{"text_format":"1","workbook":"xlsx","n_sheets":2,"sheets":["FORMULARZ_Szablon","Baza danych"],"not_rendered":{"charts":0,"images":5,"macros":1,"external_links":0,"defined_names":1,"comments":0,"pivot_tables":0},"unopened":[],"bounds":{"document_bytes":16777216,"sheet_cells":100000,"rows_first":2000,"rows_last":500,"rows_between":2000,"halvings":0,"cell_chars":16384,"cell_head_chars":4096},"cells_cut":0,"cells_raw":0,"read":"whole","date_system":"1900"}

{"sheet":"FORMULARZ_Szablon","index":0,"n_rows":21,"n_cols":24,"rows_kept":21,"cut":false,"hidden":false,"merged":[[0,0,0,26],[2,0,2,3],[4,9,4,17],[4,1,4,4],[20,0,21,26],[18,1,18,8],[18,9,18,13],[18,20,18,26],[16,1,16,8],[16,9,16,21],[18,14,18,19],[8,21,8,26],[8,7,8,9],[10,7,10,9],[10,21,10,22],[6,1,6,6],[10,14,10,16],[10,17,10,20],[6,18,6,21],[6,22,6,26],[10,23,10,26],[14,7,14,16],[2,10,2,19],[12,1,12,6],[12,7,12,9],[12,10,12,13],[12,14,12,17],[12,18,12,21],[10,1,10,6],[10,10,10,13],[2,20,2,26],[2,4,2,8],[6,7,6,16],[8,17,8,20],[14,1,14,6],[8,10,8,16],[8,1,8,6]]}
["Zlecenie produkcyjne"]
[]
["Nr",null,null,null,null,null,null,null,null,null,"Termin realizacji:"]
[]
[null,"Dział:",null,null,null,null,null,null,null,"BIURO"]
[]
["□","Model",null,null,null,null,null,null,null,null,null,null,null,null,null,null,null,null,"Ilość:"]
[]
["□","Materiał",null,null,null,null,null,"Rodzaj:",null,null,null,null,null,null,null,null,null,"Dostawca"]
[]
["□","Wymiary",null,null,null,null,null,"Wymiary:",null,null,null,null,null,null,"Grubość:",null,null,null,null,null,null,"Kod:",null,{"$f":"INDEX('Baza danych'!$A$36:$B$42,MATCH($V$9,'Baza danych'!$A$36:$A$42,0),2)","v":{"$error":"#N/A"}}]
[]
["□","Lakier",null,null,null,null,null,"Typ:",null,null,null,null,null,null,"Kolor:"]
[]
["□","ŁĄCZENIE"]
[]
["□","Prowadzi"]
[]
["□","Wydano do realizji",null,null,null,null,null,null,null,null,null,null,null,null,"Podpis odbierającego",null,null,null,null,null,"……………………………."]
[]
["RYSUNEK POGLĄDOWY"]

{"sheet":"Baza danych","index":1,"n_rows":142,"n_cols":5,"rows_kept":142,"cut":false,"hidden":false,"merged":[[99,0,99,4],[113,0,113,4],[127,0,127,4],[141,0,141,4],[12,0,12,4],[23,0,23,5],[34,0,34,1],[85,0,85,4]]}
[]
["Dział firmy","MODEL"]
["BIURO","PODSTAWOWY"]
["MAGAZYN","KLASYCZNY"]
["KIEROWNIK","NOWOCZESNY"]
["SPAWANIE","RETRO"]
["LAKIERNIA","NEW 2020"]
["MONTAŻ"]
[]
[]
[]
[]
["MATERIAŁ"]
["PODSTAWOWY","KLASYCZNY","NOWOCZESNY","RETRO","NEW 2020"]
["BLACHA CZARNA","BLACHA CZARNA","BLACHA NIERDZEW","BLACHA CZARNA","ALUMINIUM"]
["BLACHA NIERDZEW","BLACHA NIERDZEW","ALUMINIUM"]
["ALUMINIUM"]
[]
[]
[]
[]
[]
[]
["MATERIAŁ - PRODUCENT"]
["BLACHA CZARNA","BLACHA NIERDZEW","ALUMINIUM"]
["NOVASTAL","BTH","ALIPLAST"]
["MITTAL","KONSORCJUM","KĘTY"]
["MIXSTAL"]
[]
[]
[]
[]
[]
[{"$f":"INDEX('Baza danych'!$A$36:$B$42,MATCH($S$9,'Baza danych'!$A$36:$A$42,0),2)","v":{"$error":"#N/A"}}]
["KODY MATERIAŁU"]
[{"$f":"A26","v":"NOVASTAL"},"N_BC"]
[{"$f":"A27","v":"MITTAL"},"M_BC"]
[{"$f":"A28","v":"MIXSTAL"},"MIX_BC"]
["BTH","B_BN"]
[{"$f":"B27","v":"KONSORCJUM"},"T_BN"]
["ALIPLAST","A_ALU"]
["KĘTY","K_ALU"]
[]
[{"$f":"OFFSET('Baza danych'!$A$46,0,0,COUNTA('Baza danych'!$A46:$A53),1)","v":{"$error":"#VALUE!"}},{"$f":"OFFSET('Baza danych'!$B$46,0,0,COUNTA('Baza danych'!$B46:$B53),1)","v":{"$error":"#VALUE!"}}]
["WYMIAR","GRUBOŚĆ"]
["1000 x 2000","0,5 mm"]
["1250 x 2500","0,8 mm"]
["1500 x 3000","1,2 mm"]
["2000 x 4000","1,5 mm"]
["2000 x 6000"]
[]
[]
[]
[]
[]
["Typ Lakieru","Kolor"]
["Epoksydowa","BRAK"]
["Poliestrowa","Biały"]
["Hybryda","Szary"]
["BRAK","Czarny"]
[null,"Różowy"]
[]
[]
[]
[{"$f":"OFFSET('Baza danych'!$A$67,0,0,COUNTA('Baza danych'!$A67:$A75),1)","v":{"$error":"#VALUE!"}}]
["ŁĄCZENIE"]
["Spawanie MIG 131"]
["Spawanie MAG 135"]
["Spawanie TIG 141"]
["Spawanie laserowe"]
["Spawanie plazmowe"]
[]
[]
[]
[]
[{"$f":"OFFSET('Baza danych'!$A$78,0,0,COUNTA('Baza danych'!$A78:$A84),1)","v":{"$error":"#VALUE!"}}]
["Prowadzi"]
["Sprzedawca A"]
["Sprzedawca B"]
["Sprzedawca C"]
["Sprzedawca D"]
[]
[]
[]
[]
["PODSTAWOWY"]
[]
[]
[]
[]
[]
[]
[]
[]
[]
[]
[]
[]
[]
["KLASYCZNY"]
[]
[]
[]
[]
[]
[]
[]
[]
[]
[]
[]
[]
[]
["NOWOCZESNY"]
[]
[]
[]
[]
[]
[]
[]
[]
[]
[]
[]
[]
[]
["RETRO"]
[]
[]
[]
[]
[]
[]
[]
[]
[]
[]
[]
[]
[]
["NEW 2020"]