{"text_format":"1","workbook":"xlsx","n_sheets":4,"sheets":["Archiwum_Plan","Archiwum_Wyk","Wskaźniki","Wykresy"],"not_rendered":{"charts":10,"images":0,"macros":1,"external_links":0,"defined_names":20,"comments":0,"pivot_tables":10},"unopened":[],"bounds":{"document_bytes":16777216,"sheet_cells":100000,"rows_first":2000,"rows_last":500,"rows_between":2000,"halvings":0,"cell_chars":16384,"cell_head_chars":4096},"cells_cut":0,"cells_raw":0,"read":"whole","date_system":"1900"}

{"sheet":"Archiwum_Plan","index":0,"n_rows":1494,"n_cols":17,"rows_kept":1494,"cut":false,"hidden":false,"merged":[]}
["Data","Zmiana","Numer detalu","Planowana Ilość","Zrealizowana ilość","Dzień:","Miesiąc:","Tydzień","Rok:","Miesiąc2"]
[43102,"Zmiana B",894,1450,1200,{"$f":"IF(A2=\"\",\"\",DAY(A2))","v":2},{"$f":"IFERROR(VLOOKUP(IF(A2=\"\",\"\",MONTH(A2)),$P$3:$Q$14,2,FALSE),\"\")","v":"Styczeń"},{"$f":"WEEKNUM(Tabela14[[#This Row],[Data]],2)","v":1},{"$f":"IF(A2=\"\",\"\",YEAR(A2))","v":2018},{"$f":"G2","v":"Styczeń"}]
[43102,"Zmiana B",2494417,51,130,2,"Styczeń",{"$f":"WEEKNUM(Tabela14[[#This Row],[Data]],2)","v":1},2018,"Styczeń",null,null,null,null,null,1,"Styczeń"]
[43102,"Zmiana B",319,490,200,2,"Styczeń",{"$f":"WEEKNUM(Tabela14[[#This Row],[Data]],2)","v":1},2018,"Styczeń",null,null,null,null,null,2,"Luty"]
[43102,"Zmiana B",101,339,200,2,"Styczeń",{"$f":"WEEKNUM(Tabela14[[#This Row],[Data]],2)","v":1},2018,"Styczeń",null,null,null,null,null,3,"Marzec"]
[43102,"Zmiana B",76,1048,1008,2,"Styczeń",{"$f":"WEEKNUM(Tabela14[[#This Row],[Data]],2)","v":1},2018,"Styczeń",null,null,null,null,null,4,"Kwiecień"]
[43102,"Zmiana B",498,733,783,2,"Styczeń",{"$f":"WEEKNUM(Tabela14[[#This Row],[Data]],2)","v":1},2018,"Styczeń",null,null,null,null,null,5,"Maj"]
[43102,"Zmiana B",326,1488,1586,2,"Styczeń",{"$f":"WEEKNUM(Tabela14[[#This Row],[Data]],2)","v":1},2018,"Styczeń",null,null,null,null,null,6,"Czerwiec"]
[43103,"Zmiana A","33503F",317,250,3,"Styczeń",{"$f":"WEEKNUM(Tabela14[[#This Row],[Data]],2)","v":1},2018,"Styczeń",null,null,null,null,null,7,"Lipiec"]
[43103,"Zmiana A","708F",64,144,3,"Styczeń",{"$f":"WEEKNUM(Tabela14[[#This Row],[Data]],2)","v":1},2018,"Styczeń",null,null,null,null,null,8,"Sierpień"]
[43103,"Zmiana A",326,1045,992,3,"Styczeń",{"$f":"WEEKNUM(Tabela14[[#This Row],[Data]],2)","v":1},2018,"Styczeń",null,null,null,null,null,9,"Wrzesień"]
[43103,"Zmiana A",498,1721,1675,3,"Styczeń",{"$f":"WEEKNUM(Tabela14[[#This Row],[Data]],2)","v":1},2018,"Styczeń",null,null,null,null,null,10,"Październik"]
[43103,"Zmiana A","334F",728,764,3,"Styczeń",{"$f":"WEEKNUM(Tabela14[[#This Row],[Data]],2)","v":1},2018,"Styczeń",null,null,null,null,null,11,"Listopad"]
[43103,"Zmiana A",570,515,340,3,"Styczeń",{"$f":"WEEKNUM(Tabela14[[#This Row],[Data]],2)","v":1},2018,"Styczeń",null,null,null,null,null,12,"Grudzień"]
[43103,"Zmiana A",414,118,100,3,"Styczeń",{"$f":"WEEKNUM(Tabela14[[#This Row],[Data]],2)","v":1},2018,"Styczeń"]
[43103,"Zmiana A",2505258,514,600,3,"Styczeń",{"$f":"WEEKNUM(Tabela14[[#This Row],[Data]],2)","v":1},2018,"Styczeń"]
[43103,"Zmiana A",812,172,250,3,"Styczeń",{"$f":"WEEKNUM(Tabela14[[#This Row],[Data]],2)","v":1},2018,"Styczeń"]
[43103,"Zmiana A",562,222,100,3,"Styczeń",{"$f":"WEEKNUM(Tabela14[[#This Row],[Data]],2)","v":1},2018,"Styczeń"]
[43103,"Zmiana A",192,533,500,3,"Styczeń",{"$f":"WEEKNUM(Tabela14[[#This Row],[Data]],2)","v":1},2018,"Styczeń"]
[43103,"Zmiana A",761,52,150,3,"Styczeń",{"$f":"WEEKNUM(Tabela14[[#This Row],[Data]],2)","v":1},2018,"Styczeń"]
[43103,"Zmiana A",888,450,400,3,"Styczeń",{"$f":"WEEKNUM(Tabela14[[#This Row],[Data]],2)","v":1},2018,"Styczeń"]
[43103,"Zmiana A",101,1028,800,3,"Styczeń",{"$f":"WEEKNUM(Tabela14[[#This Row],[Data]],2)","v":1},2018,"Styczeń"]
[43103,"Zmiana A",2408709,93,150,3,"Styczeń",{"$f":"WEEKNUM(Tabela14[[#This Row],[Data]],2)","v":1},2018,"Styczeń"]
[43103,"Zmiana A",514,10412,10500,3,"Styczeń",{"$f":"WEEKNUM(Tabela14[[#This Row],[Data]],2)","v":1},2018,"Styczeń"]
[43103,"Zmiana B",356,241,99,3,"Styczeń",{"$f":"WEEKNUM(Tabela14[[#This Row],[Data]],2)","v":1},2018,"Styczeń"]
[43103,"Zmiana B",198,476,301,3,"Styczeń",{"$f":"WEEKNUM(Tabela14[[#This Row],[Data]],2)","v":1},2018,"Styczeń"]
[43103,"Zmiana B",845,2266,2000,3,"Styczeń",{"$f":"WEEKNUM(Tabela14[[#This Row],[Data]],2)","v":1},2018,"Styczeń"]
[43103,"Zmiana B",746,653,400,3,"Styczeń",{"$f":"WEEKNUM(Tabela14[[#This Row],[Data]],2)","v":1},2018,"Styczeń"]
[43103,"Zmiana B","33501f",440,219,3,"Styczeń",{"$f":"WEEKNUM(Tabela14[[#This Row],[Data]],2)","v":1},2018,"Styczeń"]
[43103,"Zmiana B",933,603,550,3,"Styczeń",{"$f":"WEEKNUM(Tabela14[[#This Row],[Data]],2)","v":1},2018,"Styczeń"]
[43103,"Zmiana B",2418977,263,180,3,"Styczeń",{"$f":"WEEKNUM(Tabela14[[#This Row],[Data]],2)","v":1},2018,"Styczeń"]
[43103,"Zmiana C",791,111,200,3,"Styczeń",{"$f":"WEEKNUM(Tabela14[[#This Row],[Data]],2)","v":1},2018,"Styczeń"]
[43103,"Zmiana C",780,192,120,3,"Styczeń",{"$f":"WEEKNUM(Tabela14[[#This Row],[Data]],2)","v":1},2018,"Styczeń"]
[43103,"Zmiana C",933,378,300,3,"Styczeń",{"$f":"WEEKNUM(Tabela14[[#This Row],[Data]],2)","v":1},2018,"Styczeń"]
[43103,"Zmiana C",498,2564,2393,3,"Styczeń",{"$f":"WEEKNUM(Tabela14[[#This Row],[Data]],2)","v":1},2018,"Styczeń"]
[43103,"Zmiana C",269,1051,810,3,"Styczeń",{"$f":"WEEKNUM(Tabela14[[#This Row],[Data]],2)","v":1},2018,"Styczeń"]
[43103,"Zmiana C",310,866,600,3,"Styczeń",{"$f":"WEEKNUM(Tabela14[[#This Row],[Data]],2)","v":1},2018,"Styczeń"]
[43103,"Zmiana C",895,192,210,3,"Styczeń",{"$f":"WEEKNUM(Tabela14[[#This Row],[Data]],2)","v":1},2018,"Styczeń"]
[43104,"Zmiana B",252,214,252,4,"Styczeń",{"$f":"WEEKNUM(Tabela14[[#This Row],[Data]],2)","v":1},2018,"Styczeń"]
[43104,"Zmiana B",2296305,676,400,4,"Styczeń",{"$f":"WEEKNUM(Tabela14[[#This Row],[Data]],2)","v":1},2018,"Styczeń"]
[43104,"Zmiana B",69,174,261,4,"Styczeń",{"$f":"WEEKNUM(Tabela14[[#This Row],[Data]],2)","v":1},2018,"Styczeń"]
[43104,"Zmiana B",498,982,1001,4,"Styczeń",{"$f":"WEEKNUM(Tabela14[[#This Row],[Data]],2)","v":1},2018,"Styczeń"]
[43104,"Zmiana B",119,361,240,4,"Styczeń",{"$f":"WEEKNUM(Tabela14[[#This Row],[Data]],2)","v":1},2018,"Styczeń"]
[43104,"Zmiana B",812,729,798,4,"Styczeń",{"$f":"WEEKNUM(Tabela14[[#This Row],[Data]],2)","v":1},2018,"Styczeń"]
[43104,"Zmiana B",2451635,36,33,4,"Styczeń",{"$f":"WEEKNUM(Tabela14[[#This Row],[Data]],2)","v":1},2018,"Styczeń"]
[43104,"Zmiana B",2334641,243,147,4,"Styczeń",{"$f":"WEEKNUM(Tabela14[[#This Row],[Data]],2)","v":1},2018,"Styczeń"]
[43104,"Zmiana B",498,2075,2170,4,"Styczeń",{"$f":"WEEKNUM(Tabela14[[#This Row],[Data]],2)","v":1},2018,"Styczeń"]
[43104,"Zmiana B",26144994,233,98,4,"Styczeń",{"$f":"WEEKNUM(Tabela14[[#This Row],[Data]],2)","v":1},2018,"Styczeń"]
[43104,"Zmiana B",812,75,121,4,"Styczeń",{"$f":"WEEKNUM(Tabela14[[#This Row],[Data]],2)","v":1},2018,"Styczeń"]
[43105,"Zmiana A",197,297,3,5,"Styczeń",{"$f":"WEEKNUM(Tabela14[[#This Row],[Data]],2)","v":1},2018,"Styczeń"]
[43105,"Zmiana A",2451635,348,230,5,"Styczeń",{"$f":"WEEKNUM(Tabela14[[#This Row],[Data]],2)","v":1},2018,"Styczeń"]
[43105,"Zmiana A",356,329,110,5,"Styczeń",{"$f":"WEEKNUM(Tabela14[[#This Row],[Data]],2)","v":1},2018,"Styczeń"]
[43105,"Zmiana A",39,307,20,5,"Styczeń",{"$f":"WEEKNUM(Tabela14[[#This Row],[Data]],2)","v":1},2018,"Styczeń"]
[43105,"Zmiana A",467,282,13,5,"Styczeń",{"$f":"WEEKNUM(Tabela14[[#This Row],[Data]],2)","v":1},2018,"Styczeń"]
[43105,"Zmiana A",843,105,10,5,"Styczeń",{"$f":"WEEKNUM(Tabela14[[#This Row],[Data]],2)","v":1},2018,"Styczeń"]
[43105,"Zmiana A",896,111,25,5,"Styczeń",{"$f":"WEEKNUM(Tabela14[[#This Row],[Data]],2)","v":1},2018,"Styczeń"]
[43105,"Zmiana A",498,2345,2400,5,"Styczeń",{"$f":"WEEKNUM(Tabela14[[#This Row],[Data]],2)","v":1},2018,"Styczeń"]
[43105,"Zmiana A",26144994,328,189,5,"Styczeń",{"$f":"WEEKNUM(Tabela14[[#This Row],[Data]],2)","v":1},2018,"Styczeń"]
[43105,"Zmiana A",119,875,600,5,"Styczeń",{"$f":"WEEKNUM(Tabela14[[#This Row],[Data]],2)","v":1},2018,"Styczeń"]
[43105,"Zmiana A",571,686,540,5,"Styczeń",{"$f":"WEEKNUM(Tabela14[[#This Row],[Data]],2)","v":1},2018,"Styczeń"]
[43105,"Zmiana A",2451636,261,180,5,"Styczeń",{"$f":"WEEKNUM(Tabela14[[#This Row],[Data]],2)","v":1},2018,"Styczeń"]
[43105,"Zmiana B",198,381,164,5,"Styczeń",{"$f":"WEEKNUM(Tabela14[[#This Row],[Data]],2)","v":1},2018,"Styczeń"]
[43105,"Zmiana B",812,1126,861,5,"Styczeń",{"$f":"WEEKNUM(Tabela14[[#This Row],[Data]],2)","v":1},2018,"Styczeń"]
[43105,"Zmiana B",570,655,360,5,"Styczeń",{"$f":"WEEKNUM(Tabela14[[#This Row],[Data]],2)","v":1},2018,"Styczeń"]
[43105,"Zmiana B",1533713,116,50,5,"Styczeń",{"$f":"WEEKNUM(Tabela14[[#This Row],[Data]],2)","v":1},2018,"Styczeń"]
[43105,"Zmiana B",467,11,7,{"$f":"IF(A66=\"\",\"\",DAY(A66))","v":5},{"$f":"IFERROR(VLOOKUP(IF(A66=\"\",\"\",MONTH(A66)),$P$3:$Q$14,2,FALSE),\"\")","v":"Styczeń"},{"$f":"WEEKNUM(Tabela14[[#This Row],[Data]],2)","v":1},{"$f":"IF(A66=\"\",\"\",YEAR(A66))","v":2018},{"$f":"G66","v":"Styczeń"}]
[43105,"Zmiana B",2418976,358,90,5,"Styczeń",{"$f":"WEEKNUM(Tabela14[[#This Row],[Data]],2)","v":1},2018,"Styczeń"]
[43105,"Zmiana B",437,86,175,5,"Styczeń",{"$f":"WEEKNUM(Tabela14[[#This Row],[Data]],2)","v":1},2018,"Styczeń"]
[43105,"Zmiana C",2297015,636,377,5,"Styczeń",{"$f":"WEEKNUM(Tabela14[[#This Row],[Data]],2)","v":1},2018,"Styczeń"]
[43105,"Zmiana C",179,1041,919,5,"Styczeń",{"$f":"WEEKNUM(Tabela14[[#This Row],[Data]],2)","v":1},2018,"Styczeń"]
[43105,"Zmiana C",2297015,276,13,5,"Styczeń",{"$f":"WEEKNUM(Tabela14[[#This Row],[Data]],2)","v":1},2018,"Styczeń"]
[43105,"Zmiana C",498,2232,1982,5,"Styczeń",{"$f":"WEEKNUM(Tabela14[[#This Row],[Data]],2)","v":1},2018,"Styczeń"]
[43105,"Zmiana C",26144994,578,378,5,"Styczeń",{"$f":"WEEKNUM(Tabela14[[#This Row],[Data]],2)","v":1},2018,"Styczeń"]
[43105,"Zmiana C",791,174,71,5,"Styczeń",{"$f":"WEEKNUM(Tabela14[[#This Row],[Data]],2)","v":1},2018,"Styczeń"]
[43105,"Zmiana C",780,123,60,5,"Styczeń",{"$f":"WEEKNUM(Tabela14[[#This Row],[Data]],2)","v":1},2018,"Styczeń"]
[43108,"Zmiana A",2632895,164,38,8,"Styczeń",{"$f":"WEEKNUM(Tabela14[[#This Row],[Data]],2)","v":2},2018,"Styczeń"]
[43108,"Zmiana A","721F",293,70,8,"Styczeń",{"$f":"WEEKNUM(Tabela14[[#This Row],[Data]],2)","v":2},2018,"Styczeń"]
[43108,"Zmiana A",26144994,681,757,8,"Styczeń",{"$f":"WEEKNUM(Tabela14[[#This Row],[Data]],2)","v":2},2018,"Styczeń"]
[43108,"Zmiana A",498,1691,1779,8,"Styczeń",{"$f":"WEEKNUM(Tabela14[[#This Row],[Data]],2)","v":2},2018,"Styczeń"]
[43108,"Zmiana A","705F",126,60,8,"Styczeń",{"$f":"WEEKNUM(Tabela14[[#This Row],[Data]],2)","v":2},2018,"Styczeń"]
[43108,"Zmiana A",179,265,31,8,"Styczeń",{"$f":"WEEKNUM(Tabela14[[#This Row],[Data]],2)","v":2},2018,"Styczeń"]
[43108,"Zmiana A",162,67,6,8,"Styczeń",{"$f":"WEEKNUM(Tabela14[[#This Row],[Data]],2)","v":2},2018,"Styczeń"]
[43108,"Zmiana A",469,226,1,8,"Styczeń",{"$f":"WEEKNUM(Tabela14[[#This Row],[Data]],2)","v":2},2018,"Styczeń"]
[43108,"Zmiana A",526,6,2,8,"Styczeń",{"$f":"WEEKNUM(Tabela14[[#This Row],[Data]],2)","v":2},2018,"Styczeń"]
[43108,"Zmiana A","719F",293,10,8,"Styczeń",{"$f":"WEEKNUM(Tabela14[[#This Row],[Data]],2)","v":2},2018,"Styczeń"]
[43108,"Zmiana A",593,270,3,8,"Styczeń",{"$f":"WEEKNUM(Tabela14[[#This Row],[Data]],2)","v":2},2018,"Styczeń"]
[43108,"Zmiana A",817,272,1,8,"Styczeń",{"$f":"WEEKNUM(Tabela14[[#This Row],[Data]],2)","v":2},2018,"Styczeń"]
[43108,"Zmiana A",2505258,113,6,8,"Styczeń",{"$f":"WEEKNUM(Tabela14[[#This Row],[Data]],2)","v":2},2018,"Styczeń"]
[43108,"Zmiana A",2296305,444,300,8,"Styczeń",{"$f":"WEEKNUM(Tabela14[[#This Row],[Data]],2)","v":2},2018,"Styczeń"]
[43108,"Zmiana A","334F",1112,897,8,"Styczeń",{"$f":"WEEKNUM(Tabela14[[#This Row],[Data]],2)","v":2},2018,"Styczeń"]
[43108,"Zmiana A",97,224,60,8,"Styczeń",{"$f":"WEEKNUM(Tabela14[[#This Row],[Data]],2)","v":2},2018,"Styczeń"]
[43108,"Zmiana A","717F",55,82,8,"Styczeń",{"$f":"WEEKNUM(Tabela14[[#This Row],[Data]],2)","v":2},2018,"Styczeń"]
[43108,"Zmiana B",702,304,27,8,"Styczeń",{"$f":"WEEKNUM(Tabela14[[#This Row],[Data]],2)","v":2},2018,"Styczeń"]
[43108,"Zmiana B",498,1032,1015,8,"Styczeń",{"$f":"WEEKNUM(Tabela14[[#This Row],[Data]],2)","v":2},2018,"Styczeń"]
[43108,"Zmiana B",2310044,552,264,8,"Styczeń",{"$f":"WEEKNUM(Tabela14[[#This Row],[Data]],2)","v":2},2018,"Styczeń"]
[43108,"Zmiana B","705F",9,20,8,"Styczeń",{"$f":"WEEKNUM(Tabela14[[#This Row],[Data]],2)","v":2},2018,"Styczeń"]
[43108,"Zmiana B",198,492,462,8,"Styczeń",{"$f":"WEEKNUM(Tabela14[[#This Row],[Data]],2)","v":2},2018,"Styczeń"]
[43108,"Zmiana B",2310044,6,72,8,"Styczeń",{"$f":"WEEKNUM(Tabela14[[#This Row],[Data]],2)","v":2},2018,"Styczeń"]
[43108,"Zmiana B",526,279,13,8,"Styczeń",{"$f":"WEEKNUM(Tabela14[[#This Row],[Data]],2)","v":2},2018,"Styczeń"]
[43108,"Zmiana B",26144994,1179,936,8,"Styczeń",{"$f":"WEEKNUM(Tabela14[[#This Row],[Data]],2)","v":2},2018,"Styczeń"]
[43108,"Zmiana B",634,302,137,8,"Styczeń",{"$f":"WEEKNUM(Tabela14[[#This Row],[Data]],2)","v":2},2018,"Styczeń"]
[43108,"Zmiana B",2310044,353,168,8,"Styczeń",{"$f":"WEEKNUM(Tabela14[[#This Row],[Data]],2)","v":2},2018,"Styczeń"]
[43108,"Zmiana B",326,530,599,8,"Styczeń",{"$f":"WEEKNUM(Tabela14[[#This Row],[Data]],2)","v":2},2018,"Styczeń"]
[43108,"Zmiana B",2432300,1001,1000,8,"Styczeń",{"$f":"WEEKNUM(Tabela14[[#This Row],[Data]],2)","v":2},2018,"Styczeń"]
[43108,"Zmiana B",269,344,70,8,"Styczeń",{"$f":"WEEKNUM(Tabela14[[#This Row],[Data]],2)","v":2},2018,"Styczeń"]
[43108,"Zmiana B",2494417,297,111,8,"Styczeń",{"$f":"WEEKNUM(Tabela14[[#This Row],[Data]],2)","v":2},2018,"Styczeń"]
[43108,"Zmiana B",2310044,348,168,8,"Styczeń",{"$f":"WEEKNUM(Tabela14[[#This Row],[Data]],2)","v":2},2018,"Styczeń"]
[43108,"Zmiana C",326,1959,1991,8,"Styczeń",{"$f":"WEEKNUM(Tabela14[[#This Row],[Data]],2)","v":2},2018,"Styczeń"]
[43108,"Zmiana C",26144994,584,379,8,"Styczeń",{"$f":"WEEKNUM(Tabela14[[#This Row],[Data]],2)","v":2},2018,"Styczeń"]
[43108,"Zmiana C",839,390,213,8,"Styczeń",{"$f":"WEEKNUM(Tabela14[[#This Row],[Data]],2)","v":2},2018,"Styczeń"]
[43109,"Zmiana A","708F",699,589,9,"Styczeń",{"$f":"WEEKNUM(Tabela14[[#This Row],[Data]],2)","v":2},2018,"Styczeń"]
[43109,"Zmiana A",26144994,330,270,9,"Styczeń",{"$f":"WEEKNUM(Tabela14[[#This Row],[Data]],2)","v":2},2018,"Styczeń"]
[43109,"Zmiana A",498,1998,2023,9,"Styczeń",{"$f":"WEEKNUM(Tabela14[[#This Row],[Data]],2)","v":2},2018,"Styczeń"]
[43109,"Zmiana A","717F",378,409,9,"Styczeń",{"$f":"WEEKNUM(Tabela14[[#This Row],[Data]],2)","v":2},2018,"Styczeń"]
[43109,"Zmiana A",2067417,106,10,9,"Styczeń",{"$f":"WEEKNUM(Tabela14[[#This Row],[Data]],2)","v":2},2018,"Styczeń"]
[43109,"Zmiana A",418,50,10,9,"Styczeń",{"$f":"WEEKNUM(Tabela14[[#This Row],[Data]],2)","v":2},2018,"Styczeń"]
[43109,"Zmiana A","800-569488-F",46,60,9,"Styczeń",{"$f":"WEEKNUM(Tabela14[[#This Row],[Data]],2)","v":2},2018,"Styczeń"]
[43109,"Zmiana A",2001723,71,40,9,"Styczeń",{"$f":"WEEKNUM(Tabela14[[#This Row],[Data]],2)","v":2},2018,"Styczeń"]
[43109,"Zmiana A",894,224,170,9,"Styczeń",{"$f":"WEEKNUM(Tabela14[[#This Row],[Data]],2)","v":2},2018,"Styczeń"]
[43109,"Zmiana A",2297015,390,273,9,"Styczeń",{"$f":"WEEKNUM(Tabela14[[#This Row],[Data]],2)","v":2},2018,"Styczeń"]
[43109,"Zmiana A",359,2,8,9,"Styczeń",{"$f":"WEEKNUM(Tabela14[[#This Row],[Data]],2)","v":2},2018,"Styczeń"]
[43109,"Zmiana A",701,267,27,9,"Styczeń",{"$f":"WEEKNUM(Tabela14[[#This Row],[Data]],2)","v":2},2018,"Styczeń"]
[43109,"Zmiana A",701,59,4,9,"Styczeń",{"$f":"WEEKNUM(Tabela14[[#This Row],[Data]],2)","v":2},2018,"Styczeń"]
[43109,"Zmiana A",2408708,501,271,9,"Styczeń",{"$f":"WEEKNUM(Tabela14[[#This Row],[Data]],2)","v":2},2018,"Styczeń"]
[43109,"Zmiana A",160,563,375,9,"Styczeń",{"$f":"WEEKNUM(Tabela14[[#This Row],[Data]],2)","v":2},2018,"Styczeń"]
[43109,"Zmiana A","710F",76,60,9,"Styczeń",{"$f":"WEEKNUM(Tabela14[[#This Row],[Data]],2)","v":2},2018,"Styczeń"]
[43109,"Zmiana A",888,123,50,9,"Styczeń",{"$f":"WEEKNUM(Tabela14[[#This Row],[Data]],2)","v":2},2018,"Styczeń"]
[43109,"Zmiana A",37,170,100,9,"Styczeń",{"$f":"WEEKNUM(Tabela14[[#This Row],[Data]],2)","v":2},2018,"Styczeń"]
[43109,"Zmiana A",1533713,67,15,9,"Styczeń",{"$f":"WEEKNUM(Tabela14[[#This Row],[Data]],2)","v":2},2018,"Styczeń"]
[43109,"Zmiana B",356,113,70,{"$f":"IF(A130=\"\",\"\",DAY(A130))","v":9},{"$f":"IFERROR(VLOOKUP(IF(A130=\"\",\"\",MONTH(A130)),$P$3:$Q$14,2,FALSE),\"\")","v":"Styczeń"},{"$f":"WEEKNUM(Tabela14[[#This Row],[Data]],2)","v":2},{"$f":"IF(A130=\"\",\"\",YEAR(A130))","v":2018},{"$f":"G130","v":"Styczeń"}]
[43109,"Zmiana B",845,282,40,9,"Styczeń",{"$f":"WEEKNUM(Tabela14[[#This Row],[Data]],2)","v":2},2018,"Styczeń"]
[43109,"Zmiana B",844,19,80,9,"Styczeń",{"$f":"WEEKNUM(Tabela14[[#This Row],[Data]],2)","v":2},2018,"Styczeń"]
[43109,"Zmiana B",2494417,409,259,9,"Styczeń",{"$f":"WEEKNUM(Tabela14[[#This Row],[Data]],2)","v":2},2018,"Styczeń"]
[43109,"Zmiana B",498,1027,738,9,"Styczeń",{"$f":"WEEKNUM(Tabela14[[#This Row],[Data]],2)","v":2},2018,"Styczeń"]
[43109,"Zmiana B",326,1253,983,9,"Styczeń",{"$f":"WEEKNUM(Tabela14[[#This Row],[Data]],2)","v":2},2018,"Styczeń"]
[43109,"Zmiana B",543,599,375,9,"Styczeń",{"$f":"WEEKNUM(Tabela14[[#This Row],[Data]],2)","v":2},2018,"Styczeń"]
[43109,"Zmiana B",2297015,320,403,9,"Styczeń",{"$f":"WEEKNUM(Tabela14[[#This Row],[Data]],2)","v":2},2018,"Styczeń"]
[43109,"Zmiana B",275,220,9,9,"Styczeń",{"$f":"WEEKNUM(Tabela14[[#This Row],[Data]],2)","v":2},2018,"Styczeń"]
[43109,"Zmiana C",326,2676,2384,9,"Styczeń",{"$f":"WEEKNUM(Tabela14[[#This Row],[Data]],2)","v":2},2018,"Styczeń"]
[43109,"Zmiana C",140,184,60,9,"Styczeń",{"$f":"WEEKNUM(Tabela14[[#This Row],[Data]],2)","v":2},2018,"Styczeń"]
[43109,"Zmiana C",2001994,286,36,9,"Styczeń",{"$f":"WEEKNUM(Tabela14[[#This Row],[Data]],2)","v":2},2018,"Styczeń"]
[43109,"Zmiana C",2451635,239,250,9,"Styczeń",{"$f":"WEEKNUM(Tabela14[[#This Row],[Data]],2)","v":2},2018,"Styczeń"]
[43109,"Zmiana C",2334641,146,36,9,"Styczeń",{"$f":"WEEKNUM(Tabela14[[#This Row],[Data]],2)","v":2},2018,"Styczeń"]
[43109,"Zmiana C",307,228,20,9,"Styczeń",{"$f":"WEEKNUM(Tabela14[[#This Row],[Data]],2)","v":2},2018,"Styczeń"]
[43109,"Zmiana C",310,121,30,9,"Styczeń",{"$f":"WEEKNUM(Tabela14[[#This Row],[Data]],2)","v":2},2018,"Styczeń"]
[43109,"Zmiana C",724,307,30,9,"Styczeń",{"$f":"WEEKNUM(Tabela14[[#This Row],[Data]],2)","v":2},2018,"Styczeń"]
[43109,"Zmiana C",103,43,15,9,"Styczeń",{"$f":"WEEKNUM(Tabela14[[#This Row],[Data]],2)","v":2},2018,"Styczeń"]
[43110,"Zmiana A","300F",304,121,10,"Styczeń",{"$f":"WEEKNUM(Tabela14[[#This Row],[Data]],2)","v":2},2018,"Styczeń"]
[43110,"Zmiana A",554,194,10,10,"Styczeń",{"$f":"WEEKNUM(Tabela14[[#This Row],[Data]],2)","v":2},2018,"Styczeń"]
[43110,"Zmiana A",545,63,6,10,"Styczeń",{"$f":"WEEKNUM(Tabela14[[#This Row],[Data]],2)","v":2},2018,"Styczeń"]
[43110,"Zmiana A",996,295,60,10,"Styczeń",{"$f":"WEEKNUM(Tabela14[[#This Row],[Data]],2)","v":2},2018,"Styczeń"]
[43110,"Zmiana A","713F",294,120,10,"Styczeń",{"$f":"WEEKNUM(Tabela14[[#This Row],[Data]],2)","v":2},2018,"Styczeń"]
[43110,"Zmiana A",2505258,283,6,10,"Styczeń",{"$f":"WEEKNUM(Tabela14[[#This Row],[Data]],2)","v":2},2018,"Styczeń"]
[43110,"Zmiana A",702,166,12,10,"Styczeń",{"$f":"WEEKNUM(Tabela14[[#This Row],[Data]],2)","v":2},2018,"Styczeń"]
[43110,"Zmiana A",767,205,36,10,"Styczeń",{"$f":"WEEKNUM(Tabela14[[#This Row],[Data]],2)","v":2},2018,"Styczeń"]
[43110,"Zmiana A",593,11,40,10,"Styczeń",{"$f":"WEEKNUM(Tabela14[[#This Row],[Data]],2)","v":2},2018,"Styczeń"]
[43110,"Zmiana A",2334641,88,150,10,"Styczeń",{"$f":"WEEKNUM(Tabela14[[#This Row],[Data]],2)","v":2},2018,"Styczeń"]
[43110,"Zmiana A",326,2528,2400,10,"Styczeń",{"$f":"WEEKNUM(Tabela14[[#This Row],[Data]],2)","v":2},2018,"Styczeń"]
[43110,"Zmiana A",812,1038,863,10,"Styczeń",{"$f":"WEEKNUM(Tabela14[[#This Row],[Data]],2)","v":2},2018,"Styczeń"]
[43110,"Zmiana A","346F",150,200,10,"Styczeń",{"$f":"WEEKNUM(Tabela14[[#This Row],[Data]],2)","v":2},2018,"Styczeń"]
[43110,"Zmiana B",172,199,10,10,"Styczeń",{"$f":"WEEKNUM(Tabela14[[#This Row],[Data]],2)","v":2},2018,"Styczeń"]
[43110,"Zmiana B",996,174,161,10,"Styczeń",{"$f":"WEEKNUM(Tabela14[[#This Row],[Data]],2)","v":2},2018,"Styczeń"]
[43110,"Zmiana B",326,1029,800,10,"Styczeń",{"$f":"WEEKNUM(Tabela14[[#This Row],[Data]],2)","v":2},2018,"Styczeń"]
[43110,"Zmiana B",2220258,435,178,10,"Styczeń",{"$f":"WEEKNUM(Tabela14[[#This Row],[Data]],2)","v":2},2018,"Styczeń"]
[43110,"Zmiana B",746,249,60,10,"Styczeń",{"$f":"WEEKNUM(Tabela14[[#This Row],[Data]],2)","v":2},2018,"Styczeń"]
[43110,"Zmiana B",41,25,40,10,"Styczeń",{"$f":"WEEKNUM(Tabela14[[#This Row],[Data]],2)","v":2},2018,"Styczeń"]
[43110,"Zmiana B",570,257,170,10,"Styczeń",{"$f":"WEEKNUM(Tabela14[[#This Row],[Data]],2)","v":2},2018,"Styczeń"]
[43110,"Zmiana B",1901726,690,518,10,"Styczeń",{"$f":"WEEKNUM(Tabela14[[#This Row],[Data]],2)","v":2},2018,"Styczeń"]
[43110,"Zmiana B",2237976,499,339,10,"Styczeń",{"$f":"WEEKNUM(Tabela14[[#This Row],[Data]],2)","v":2},2018,"Styczeń"]
[43110,"Zmiana B",2451635,215,270,10,"Styczeń",{"$f":"WEEKNUM(Tabela14[[#This Row],[Data]],2)","v":2},2018,"Styczeń"]
[43110,"Zmiana B",76,443,154,10,"Styczeń",{"$f":"WEEKNUM(Tabela14[[#This Row],[Data]],2)","v":2},2018,"Styczeń"]
[43110,"Zmiana B",356,555,447,10,"Styczeń",{"$f":"WEEKNUM(Tabela14[[#This Row],[Data]],2)","v":2},2018,"Styczeń"]
[43110,"Zmiana C",26144994,1599,1515,10,"Styczeń",{"$f":"WEEKNUM(Tabela14[[#This Row],[Data]],2)","v":2},2018,"Styczeń"]
[43110,"Zmiana C",498,731,800,10,"Styczeń",{"$f":"WEEKNUM(Tabela14[[#This Row],[Data]],2)","v":2},2018,"Styczeń"]
[43110,"Zmiana C",310,96,40,10,"Styczeń",{"$f":"WEEKNUM(Tabela14[[#This Row],[Data]],2)","v":2},2018,"Styczeń"]
[43110,"Zmiana C",546,57,10,10,"Styczeń",{"$f":"WEEKNUM(Tabela14[[#This Row],[Data]],2)","v":2},2018,"Styczeń"]
[43110,"Zmiana C",431,397,432,10,"Styczeń",{"$f":"WEEKNUM(Tabela14[[#This Row],[Data]],2)","v":2},2018,"Styczeń"]
[43111,"Zmiana A","346F",471,200,11,"Styczeń",{"$f":"WEEKNUM(Tabela14[[#This Row],[Data]],2)","v":2},2018,"Styczeń"]
[43111,"Zmiana A",269,126,69,11,"Styczeń",{"$f":"WEEKNUM(Tabela14[[#This Row],[Data]],2)","v":2},2018,"Styczeń"]
[43111,"Zmiana A",153,42,18,11,"Styczeń",{"$f":"WEEKNUM(Tabela14[[#This Row],[Data]],2)","v":2},2018,"Styczeń"]
[43111,"Zmiana A","33501F",545,335,11,"Styczeń",{"$f":"WEEKNUM(Tabela14[[#This Row],[Data]],2)","v":2},2018,"Styczeń"]
[43111,"Zmiana A",319,60,20,11,"Styczeń",{"$f":"WEEKNUM(Tabela14[[#This Row],[Data]],2)","v":2},2018,"Styczeń"]
[43111,"Zmiana A",726,140,22,11,"Styczeń",{"$f":"WEEKNUM(Tabela14[[#This Row],[Data]],2)","v":2},2018,"Styczeń"]
[43111,"Zmiana A",498,2601,2598,11,"Styczeń",{"$f":"WEEKNUM(Tabela14[[#This Row],[Data]],2)","v":2},2018,"Styczeń"]
[43111,"Zmiana A",119,722,600,11,"Styczeń",{"$f":"WEEKNUM(Tabela14[[#This Row],[Data]],2)","v":2},2018,"Styczeń"]
[43111,"Zmiana A",2451636,533,240,11,"Styczeń",{"$f":"WEEKNUM(Tabela14[[#This Row],[Data]],2)","v":2},2018,"Styczeń"]
[43111,"Zmiana A",787,556,385,11,"Styczeń",{"$f":"WEEKNUM(Tabela14[[#This Row],[Data]],2)","v":2},2018,"Styczeń"]
[43111,"Zmiana B",812,563,276,11,"Styczeń",{"$f":"WEEKNUM(Tabela14[[#This Row],[Data]],2)","v":2},2018,"Styczeń"]
[43111,"Zmiana B",2334641,469,230,11,"Styczeń",{"$f":"WEEKNUM(Tabela14[[#This Row],[Data]],2)","v":2},2018,"Styczeń"]
[43111,"Zmiana B",2297015,154,108,11,"Styczeń",{"$f":"WEEKNUM(Tabela14[[#This Row],[Data]],2)","v":2},2018,"Styczeń"]
[43111,"Zmiana B",198,476,238,11,"Styczeń",{"$f":"WEEKNUM(Tabela14[[#This Row],[Data]],2)","v":2},2018,"Styczeń"]
[43111,"Zmiana B",2451636,339,119,11,"Styczeń",{"$f":"WEEKNUM(Tabela14[[#This Row],[Data]],2)","v":2},2018,"Styczeń"]
[43111,"Zmiana B",275,44,87,11,"Styczeń",{"$f":"WEEKNUM(Tabela14[[#This Row],[Data]],2)","v":2},2018,"Styczeń"]
[43111,"Zmiana B",560,581,324,{"$f":"IF(A194=\"\",\"\",DAY(A194))","v":11},{"$f":"IFERROR(VLOOKUP(IF(A194=\"\",\"\",MONTH(A194)),$P$3:$Q$14,2,FALSE),\"\")","v":"Styczeń"},{"$f":"WEEKNUM(Tabela14[[#This Row],[Data]],2)","v":2},{"$f":"IF(A194=\"\",\"\",YEAR(A194))","v":2018},{"$f":"G194","v":"Styczeń"}]
[43111,"Zmiana B",498,1175,1195,11,"Styczeń",{"$f":"WEEKNUM(Tabela14[[#This Row],[Data]],2)","v":2},2018,"Styczeń"]
[43111,"Zmiana B",101,299,220,11,"Styczeń",{"$f":"WEEKNUM(Tabela14[[#This Row],[Data]],2)","v":2},2018,"Styczeń"]
[43111,"Zmiana B",437,603,527,11,"Styczeń",{"$f":"WEEKNUM(Tabela14[[#This Row],[Data]],2)","v":2},2018,"Styczeń"]
[43111,"Zmiana B",787,165,192,11,"Styczeń",{"$f":"WEEKNUM(Tabela14[[#This Row],[Data]],2)","v":2},2018,"Styczeń"]
[43111,"Zmiana C",26144994,946,945,11,"Styczeń",{"$f":"WEEKNUM(Tabela14[[#This Row],[Data]],2)","v":2},2018,"Styczeń"]
[43111,"Zmiana C",498,1656,1386,11,"Styczeń",{"$f":"WEEKNUM(Tabela14[[#This Row],[Data]],2)","v":2},2018,"Styczeń"]
[43111,"Zmiana C",119,588,520,11,"Styczeń",{"$f":"WEEKNUM(Tabela14[[#This Row],[Data]],2)","v":2},2018,"Styczeń"]
[43112,"Zmiana B","717F",641,491,12,"Styczeń",{"$f":"WEEKNUM(Tabela14[[#This Row],[Data]],2)","v":2},2018,"Styczeń"]
[43112,"Zmiana B",2296305,228,300,12,"Styczeń",{"$f":"WEEKNUM(Tabela14[[#This Row],[Data]],2)","v":2},2018,"Styczeń"]
[43112,"Zmiana B","334F",318,339,12,"Styczeń",{"$f":"WEEKNUM(Tabela14[[#This Row],[Data]],2)","v":2},2018,"Styczeń"]
[43112,"Zmiana B",482,196,10,12,"Styczeń",{"$f":"WEEKNUM(Tabela14[[#This Row],[Data]],2)","v":2},2018,"Styczeń"]
[43112,"Zmiana B",562,20,10,12,"Styczeń",{"$f":"WEEKNUM(Tabela14[[#This Row],[Data]],2)","v":2},2018,"Styczeń"]
[43112,"Zmiana B",780,24,22,12,"Styczeń",{"$f":"WEEKNUM(Tabela14[[#This Row],[Data]],2)","v":2},2018,"Styczeń"]
[43112,"Zmiana B",791,216,9,12,"Styczeń",{"$f":"WEEKNUM(Tabela14[[#This Row],[Data]],2)","v":2},2018,"Styczeń"]
[43112,"Zmiana B",761,11,30,12,"Styczeń",{"$f":"WEEKNUM(Tabela14[[#This Row],[Data]],2)","v":2},2018,"Styczeń"]
[43112,"Zmiana B",498,2608,2597,12,"Styczeń",{"$f":"WEEKNUM(Tabela14[[#This Row],[Data]],2)","v":2},2018,"Styczeń"]
[43112,"Zmiana B",812,603,500,12,"Styczeń",{"$f":"WEEKNUM(Tabela14[[#This Row],[Data]],2)","v":2},2018,"Styczeń"]
[43112,"Zmiana B",76,540,246,12,"Styczeń",{"$f":"WEEKNUM(Tabela14[[#This Row],[Data]],2)","v":2},2018,"Styczeń"]
[43112,"Zmiana B",812,172,141,12,"Styczeń",{"$f":"WEEKNUM(Tabela14[[#This Row],[Data]],2)","v":2},2018,"Styczeń"]
[43112,"Zmiana B",560,467,186,12,"Styczeń",{"$f":"WEEKNUM(Tabela14[[#This Row],[Data]],2)","v":2},2018,"Styczeń"]
[43112,"Zmiana B",2149709,335,239,12,"Styczeń",{"$f":"WEEKNUM(Tabela14[[#This Row],[Data]],2)","v":2},2018,"Styczeń"]
[43112,"Zmiana B",966,186,88,12,"Styczeń",{"$f":"WEEKNUM(Tabela14[[#This Row],[Data]],2)","v":2},2018,"Styczeń"]
[43112,"Zmiana B",69,211,80,12,"Styczeń",{"$f":"WEEKNUM(Tabela14[[#This Row],[Data]],2)","v":2},2018,"Styczeń"]
[43112,"Zmiana B",76,565,440,12,"Styczeń",{"$f":"WEEKNUM(Tabela14[[#This Row],[Data]],2)","v":2},2018,"Styczeń"]
[43112,"Zmiana B",2551650,137,16,12,"Styczeń",{"$f":"WEEKNUM(Tabela14[[#This Row],[Data]],2)","v":2},2018,"Styczeń"]
[43112,"Zmiana B",2551651,22,16,12,"Styczeń",{"$f":"WEEKNUM(Tabela14[[#This Row],[Data]],2)","v":2},2018,"Styczeń"]
[43112,"Zmiana C",498,2394,2369,12,"Styczeń",{"$f":"WEEKNUM(Tabela14[[#This Row],[Data]],2)","v":2},2018,"Styczeń"]
[43115,"Zmiana A","708F",728,467,15,"Styczeń",{"$f":"WEEKNUM(Tabela14[[#This Row],[Data]],2)","v":3},2018,"Styczeń"]
[43115,"Zmiana A",2297015,448,227,15,"Styczeń",{"$f":"WEEKNUM(Tabela14[[#This Row],[Data]],2)","v":3},2018,"Styczeń"]
[43115,"Zmiana A",319,286,2,15,"Styczeń",{"$f":"WEEKNUM(Tabela14[[#This Row],[Data]],2)","v":3},2018,"Styczeń"]
[43115,"Zmiana A",416,5,2,15,"Styczeń",{"$f":"WEEKNUM(Tabela14[[#This Row],[Data]],2)","v":3},2018,"Styczeń"]
[43115,"Zmiana A",2067417,303,10,15,"Styczeń",{"$f":"WEEKNUM(Tabela14[[#This Row],[Data]],2)","v":3},2018,"Styczeń"]
[43115,"Zmiana A",197,60,3,15,"Styczeń",{"$f":"WEEKNUM(Tabela14[[#This Row],[Data]],2)","v":3},2018,"Styczeń"]
[43115,"Zmiana A","716F",674,544,15,"Styczeń",{"$f":"WEEKNUM(Tabela14[[#This Row],[Data]],2)","v":3},2018,"Styczeń"]
[43115,"Zmiana A",2510103,8,15,15,"Styczeń",{"$f":"WEEKNUM(Tabela14[[#This Row],[Data]],2)","v":3},2018,"Styczeń"]
[43115,"Zmiana A",575,139,15,15,"Styczeń",{"$f":"WEEKNUM(Tabela14[[#This Row],[Data]],2)","v":3},2018,"Styczeń"]
[43115,"Zmiana A",560,79,32,15,"Styczeń",{"$f":"WEEKNUM(Tabela14[[#This Row],[Data]],2)","v":3},2018,"Styczeń"]
[43115,"Zmiana A",562,19,30,15,"Styczeń",{"$f":"WEEKNUM(Tabela14[[#This Row],[Data]],2)","v":3},2018,"Styczeń"]
[43115,"Zmiana A",498,2813,2621,15,"Styczeń",{"$f":"WEEKNUM(Tabela14[[#This Row],[Data]],2)","v":3},2018,"Styczeń"]
[43115,"Zmiana A","705F",68,16,15,"Styczeń",{"$f":"WEEKNUM(Tabela14[[#This Row],[Data]],2)","v":3},2018,"Styczeń"]
[43115,"Zmiana A","721F",303,385,15,"Styczeń",{"$f":"WEEKNUM(Tabela14[[#This Row],[Data]],2)","v":3},2018,"Styczeń"]
[43115,"Zmiana A",2310044,532,336,15,"Styczeń",{"$f":"WEEKNUM(Tabela14[[#This Row],[Data]],2)","v":3},2018,"Styczeń"]
[43115,"Zmiana A",76,928,858,15,"Styczeń",{"$f":"WEEKNUM(Tabela14[[#This Row],[Data]],2)","v":3},2018,"Styczeń"]
[43115,"Zmiana A","710F",204,29,15,"Styczeń",{"$f":"WEEKNUM(Tabela14[[#This Row],[Data]],2)","v":3},2018,"Styczeń"]
[43115,"Zmiana B",198,539,300,15,"Styczeń",{"$f":"WEEKNUM(Tabela14[[#This Row],[Data]],2)","v":3},2018,"Styczeń"]
[43115,"Zmiana B",780,30,20,15,"Styczeń",{"$f":"WEEKNUM(Tabela14[[#This Row],[Data]],2)","v":3},2018,"Styczeń"]
[43115,"Zmiana B",817,81,1,15,"Styczeń",{"$f":"WEEKNUM(Tabela14[[#This Row],[Data]],2)","v":3},2018,"Styczeń"]
[43115,"Zmiana B",513,186,58,15,"Styczeń",{"$f":"WEEKNUM(Tabela14[[#This Row],[Data]],2)","v":3},2018,"Styczeń"]
[43115,"Zmiana B",2432300,865,711,15,"Styczeń",{"$f":"WEEKNUM(Tabela14[[#This Row],[Data]],2)","v":3},2018,"Styczeń"]
[43115,"Zmiana B",2408708,20,51,15,"Styczeń",{"$f":"WEEKNUM(Tabela14[[#This Row],[Data]],2)","v":3},2018,"Styczeń"]
[43115,"Zmiana B",2494417,183,234,15,"Styczeń",{"$f":"WEEKNUM(Tabela14[[#This Row],[Data]],2)","v":3},2018,"Styczeń"]
[43115,"Zmiana B",570,91,156,15,"Styczeń",{"$f":"WEEKNUM(Tabela14[[#This Row],[Data]],2)","v":3},2018,"Styczeń"]
[43115,"Zmiana B",69,43,60,15,"Styczeń",{"$f":"WEEKNUM(Tabela14[[#This Row],[Data]],2)","v":3},2018,"Styczeń"]
["2018-01-16","Zmiana B","717F",664,415,16,"Styczeń",{"$f":"WEEKNUM(Tabela14[[#This Row],[Data]],2)","v":3},2018,"Styczeń"]
["2018-01-16","Zmiana B",2007977,18,80,16,"Styczeń",{"$f":"WEEKNUM(Tabela14[[#This Row],[Data]],2)","v":3},2018,"Styczeń"]
["2018-01-16","Zmiana B",418,14,10,16,"Styczeń",{"$f":"WEEKNUM(Tabela14[[#This Row],[Data]],2)","v":3},2018,"Styczeń"]
["2018-01-16","Zmiana B",51,156,1,16,"Styczeń",{"$f":"WEEKNUM(Tabela14[[#This Row],[Data]],2)","v":3},2018,"Styczeń"]
["2018-01-16","Zmiana B","334F",432,500,16,"Styczeń",{"$f":"WEEKNUM(Tabela14[[#This Row],[Data]],2)","v":3},2018,"Styczeń"]
["2018-01-16","Zmiana B",469,38,20,16,"Styczeń",{"$f":"WEEKNUM(Tabela14[[#This Row],[Data]],2)","v":3},2018,"Styczeń"]
["2018-01-16","Zmiana B",701,248,27,16,"Styczeń",{"$f":"WEEKNUM(Tabela14[[#This Row],[Data]],2)","v":3},2018,"Styczeń"]
["2018-01-16","Zmiana B",2009613,187,40,16,"Styczeń",{"$f":"WEEKNUM(Tabela14[[#This Row],[Data]],2)","v":3},2018,"Styczeń"]
["2018-01-16","Zmiana B",693,3930,3773,16,"Styczeń",{"$f":"WEEKNUM(Tabela14[[#This Row],[Data]],2)","v":3},2018,"Styczeń"]
["2018-01-16","Zmiana B",498,2311,2395,16,"Styczeń",{"$f":"WEEKNUM(Tabela14[[#This Row],[Data]],2)","v":3},2018,"Styczeń"]
["2018-01-16","Zmiana B",26144994,645,362,{"$f":"IF(A258=\"\",\"\",DAY(A258))","v":16},{"$f":"IFERROR(VLOOKUP(IF(A258=\"\",\"\",MONTH(A258)),$P$3:$Q$14,2,FALSE),\"\")","v":"Styczeń"},{"$f":"WEEKNUM(Tabela14[[#This Row],[Data]],2)","v":3},{"$f":"IF(A258=\"\",\"\",YEAR(A258))","v":2018},{"$f":"G258","v":"Styczeń"}]
["2018-01-16","Zmiana B",202,171,72,16,"Styczeń",{"$f":"WEEKNUM(Tabela14[[#This Row],[Data]],2)","v":3},2018,"Styczeń"]
["2018-01-16","Zmiana B",888,127,24,16,"Styczeń",{"$f":"WEEKNUM(Tabela14[[#This Row],[Data]],2)","v":3},2018,"Styczeń"]
["2018-01-16","Zmiana B",839,85,60,16,"Styczeń",{"$f":"WEEKNUM(Tabela14[[#This Row],[Data]],2)","v":3},2018,"Styczeń"]
["2018-01-16","Zmiana B",2451636,311,221,16,"Styczeń",{"$f":"WEEKNUM(Tabela14[[#This Row],[Data]],2)","v":3},2018,"Styczeń"]
["2018-01-16","Zmiana B",437,272,128,16,"Styczeń",{"$f":"WEEKNUM(Tabela14[[#This Row],[Data]],2)","v":3},2018,"Styczeń"]
["2018-01-16","Zmiana B",2408708,20,62,16,"Styczeń",{"$f":"WEEKNUM(Tabela14[[#This Row],[Data]],2)","v":3},2018,"Styczeń"]
["2018-01-16","Zmiana B",2375097,343,72,16,"Styczeń",{"$f":"WEEKNUM(Tabela14[[#This Row],[Data]],2)","v":3},2018,"Styczeń"]
["2018-01-16","Zmiana B",2310044,823,600,16,"Styczeń",{"$f":"WEEKNUM(Tabela14[[#This Row],[Data]],2)","v":3},2018,"Styczeń"]
["2018-01-16","Zmiana B",179,555,537,16,"Styczeń",{"$f":"WEEKNUM(Tabela14[[#This Row],[Data]],2)","v":3},2018,"Styczeń"]
["2018-01-16","Zmiana B",944,58,20,16,"Styczeń",{"$f":"WEEKNUM(Tabela14[[#This Row],[Data]],2)","v":3},2018,"Styczeń"]
["2018-01-16","Zmiana B",791,59,20,16,"Styczeń",{"$f":"WEEKNUM(Tabela14[[#This Row],[Data]],2)","v":3},2018,"Styczeń"]
["2018-01-16","Zmiana B",437,295,128,16,"Styczeń",{"$f":"WEEKNUM(Tabela14[[#This Row],[Data]],2)","v":3},2018,"Styczeń"]
["2018-01-16","Zmiana B",2408708,299,62,16,"Styczeń",{"$f":"WEEKNUM(Tabela14[[#This Row],[Data]],2)","v":3},2018,"Styczeń"]
["2018-01-16","Zmiana B",2375097,297,72,16,"Styczeń",{"$f":"WEEKNUM(Tabela14[[#This Row],[Data]],2)","v":3},2018,"Styczeń"]
["2018-01-16","Zmiana B",2310044,651,600,16,"Styczeń",{"$f":"WEEKNUM(Tabela14[[#This Row],[Data]],2)","v":3},2018,"Styczeń"]
["2018-01-16","Zmiana B",179,510,537,16,"Styczeń",{"$f":"WEEKNUM(Tabela14[[#This Row],[Data]],2)","v":3},2018,"Styczeń"]
["2018-01-16","Zmiana B",944,98,20,16,"Styczeń",{"$f":"WEEKNUM(Tabela14[[#This Row],[Data]],2)","v":3},2018,"Styczeń"]
["2018-01-16","Zmiana B",791,165,20,16,"Styczeń",{"$f":"WEEKNUM(Tabela14[[#This Row],[Data]],2)","v":3},2018,"Styczeń"]
["2018-01-16","Zmiana B",437,111,128,16,"Styczeń",{"$f":"WEEKNUM(Tabela14[[#This Row],[Data]],2)","v":3},2018,"Styczeń"]
["2018-01-16","Zmiana B",2408708,134,62,16,"Styczeń",{"$f":"WEEKNUM(Tabela14[[#This Row],[Data]],2)","v":3},2018,"Styczeń"]
["2018-01-16","Zmiana B",2375097,299,72,16,"Styczeń",{"$f":"WEEKNUM(Tabela14[[#This Row],[Data]],2)","v":3},2018,"Styczeń"]
["2018-01-16","Zmiana B",2310044,568,600,16,"Styczeń",{"$f":"WEEKNUM(Tabela14[[#This Row],[Data]],2)","v":3},2018,"Styczeń"]
["2018-01-16","Zmiana B",179,764,537,16,"Styczeń",{"$f":"WEEKNUM(Tabela14[[#This Row],[Data]],2)","v":3},2018,"Styczeń"]
["2018-01-16","Zmiana B",944,101,20,16,"Styczeń",{"$f":"WEEKNUM(Tabela14[[#This Row],[Data]],2)","v":3},2018,"Styczeń"]
["2018-01-16","Zmiana B",791,118,20,16,"Styczeń",{"$f":"WEEKNUM(Tabela14[[#This Row],[Data]],2)","v":3},2018,"Styczeń"]
["2018-01-16","Zmiana C",326,1914,1998,16,"Styczeń",{"$f":"WEEKNUM(Tabela14[[#This Row],[Data]],2)","v":3},2018,"Styczeń"]
["2018-01-16","Zmiana C",26144994,675,379,16,"Styczeń",{"$f":"WEEKNUM(Tabela14[[#This Row],[Data]],2)","v":3},2018,"Styczeń"]
["2018-01-17","Zmiana B",780,110,20,17,"Styczeń",{"$f":"WEEKNUM(Tabela14[[#This Row],[Data]],2)","v":3},2018,"Styczeń"]
["2018-01-17","Zmiana B",791,5,20,17,"Styczeń",{"$f":"WEEKNUM(Tabela14[[#This Row],[Data]],2)","v":3},2018,"Styczeń"]
["2018-01-17","Zmiana B",812,158,109,17,"Styczeń",{"$f":"WEEKNUM(Tabela14[[#This Row],[Data]],2)","v":3},2018,"Styczeń"]
["2018-01-17","Zmiana B","33501F",994,697,17,"Styczeń",{"$f":"WEEKNUM(Tabela14[[#This Row],[Data]],2)","v":3},2018,"Styczeń"]
["2018-01-17","Zmiana B",2632895,310,40,17,"Styczeń",{"$f":"WEEKNUM(Tabela14[[#This Row],[Data]],2)","v":3},2018,"Styczeń"]
["2018-01-17","Zmiana B",2296305,661,550,17,"Styczeń",{"$f":"WEEKNUM(Tabela14[[#This Row],[Data]],2)","v":3},2018,"Styczeń"]
["2018-01-17","Zmiana B",252,351,241,17,"Styczeń",{"$f":"WEEKNUM(Tabela14[[#This Row],[Data]],2)","v":3},2018,"Styczeń"]
["2018-01-17","Zmiana C",326,2062,1805,17,"Styczeń",{"$f":"WEEKNUM(Tabela14[[#This Row],[Data]],2)","v":3},2018,"Styczeń"]
["2018-01-17","Zmiana C",26144994,628,562,17,"Styczeń",{"$f":"WEEKNUM(Tabela14[[#This Row],[Data]],2)","v":3},2018,"Styczeń"]
["2018-01-18","Zmiana A","710F",126,91,18,"Styczeń",{"$f":"WEEKNUM(Tabela14[[#This Row],[Data]],2)","v":3},2018,"Styczeń"]
["2018-01-18","Zmiana A","802F",311,259,18,"Styczeń",{"$f":"WEEKNUM(Tabela14[[#This Row],[Data]],2)","v":3},2018,"Styczeń"]
["2018-01-18","Zmiana A","33501F",421,344,18,"Styczeń",{"$f":"WEEKNUM(Tabela14[[#This Row],[Data]],2)","v":3},2018,"Styczeń"]
["2018-01-18","Zmiana A","33503F",1027,750,18,"Styczeń",{"$f":"WEEKNUM(Tabela14[[#This Row],[Data]],2)","v":3},2018,"Styczeń"]
["2018-01-18","Zmiana A",812,772,500,18,"Styczeń",{"$f":"WEEKNUM(Tabela14[[#This Row],[Data]],2)","v":3},2018,"Styczeń"]
["2018-01-18","Zmiana A",958,286,34,18,"Styczeń",{"$f":"WEEKNUM(Tabela14[[#This Row],[Data]],2)","v":3},2018,"Styczeń"]
["2018-01-18","Zmiana A",570,643,494,18,"Styczeń",{"$f":"WEEKNUM(Tabela14[[#This Row],[Data]],2)","v":3},2018,"Styczeń"]
["2018-01-18","Zmiana A",498,2638,2566,18,"Styczeń",{"$f":"WEEKNUM(Tabela14[[#This Row],[Data]],2)","v":3},2018,"Styczeń"]
["2018-01-18","Zmiana A",2007977,3,40,18,"Styczeń",{"$f":"WEEKNUM(Tabela14[[#This Row],[Data]],2)","v":3},2018,"Styczeń"]
["2018-01-18","Zmiana A",2408708,493,360,18,"Styczeń",{"$f":"WEEKNUM(Tabela14[[#This Row],[Data]],2)","v":3},2018,"Styczeń"]
["2018-01-18","Zmiana A",202,314,130,18,"Styczeń",{"$f":"WEEKNUM(Tabela14[[#This Row],[Data]],2)","v":3},2018,"Styczeń"]
["2018-01-18","Zmiana B",701,9,4,18,"Styczeń",{"$f":"WEEKNUM(Tabela14[[#This Row],[Data]],2)","v":3},2018,"Styczeń"]
["2018-01-18","Zmiana B",617,34,2,18,"Styczeń",{"$f":"WEEKNUM(Tabela14[[#This Row],[Data]],2)","v":3},2018,"Styczeń"]
["2018-01-18","Zmiana B",780,57,20,18,"Styczeń",{"$f":"WEEKNUM(Tabela14[[#This Row],[Data]],2)","v":3},2018,"Styczeń"]
["2018-01-18","Zmiana B",791,19,40,18,"Styczeń",{"$f":"WEEKNUM(Tabela14[[#This Row],[Data]],2)","v":3},2018,"Styczeń"]
["2018-01-18","Zmiana B",894,328,91,18,"Styczeń",{"$f":"WEEKNUM(Tabela14[[#This Row],[Data]],2)","v":3},2018,"Styczeń"]
["2018-01-18","Zmiana B","33501F",426,500,18,"Styczeń",{"$f":"WEEKNUM(Tabela14[[#This Row],[Data]],2)","v":3},2018,"Styczeń"]
["2018-01-18","Zmiana B",514,114,90,18,"Styczeń",{"$f":"WEEKNUM(Tabela14[[#This Row],[Data]],2)","v":3},2018,"Styczeń"]
["2018-01-18","Zmiana B",845,55,20,18,"Styczeń",{"$f":"WEEKNUM(Tabela14[[#This Row],[Data]],2)","v":3},2018,"Styczeń"]
["2018-01-18","Zmiana B",812,1153,1120,18,"Styczeń",{"$f":"WEEKNUM(Tabela14[[#This Row],[Data]],2)","v":3},2018,"Styczeń"]
["2018-01-18","Zmiana B",2494417,430,160,18,"Styczeń",{"$f":"WEEKNUM(Tabela14[[#This Row],[Data]],2)","v":3},2018,"Styczeń"]
["2018-01-18","Zmiana C",326,2267,2355,18,"Styczeń",{"$f":"WEEKNUM(Tabela14[[#This Row],[Data]],2)","v":3},2018,"Styczeń"]
["2018-01-19","Zmiana A","33505F",82,5,19,"Styczeń",{"$f":"WEEKNUM(Tabela14[[#This Row],[Data]],2)","v":3},2018,"Styczeń"]
["2018-01-19","Zmiana A","33501F",27,23,19,"Styczeń",{"$f":"WEEKNUM(Tabela14[[#This Row],[Data]],2)","v":3},2018,"Styczeń"]
["2018-01-19","Zmiana A",643,107,24,19,"Styczeń",{"$f":"WEEKNUM(Tabela14[[#This Row],[Data]],2)","v":3},2018,"Styczeń"]
["2018-01-19","Zmiana A",319,25,20,19,"Styczeń",{"$f":"WEEKNUM(Tabela14[[#This Row],[Data]],2)","v":3},2018,"Styczeń"]
["2018-01-19","Zmiana A","33503F",503,500,19,"Styczeń",{"$f":"WEEKNUM(Tabela14[[#This Row],[Data]],2)","v":3},2018,"Styczeń"]
["2018-01-19","Zmiana A",2126381,132,50,{"$f":"IF(A322=\"\",\"\",DAY(A322))","v":19},{"$f":"IFERROR(VLOOKUP(IF(A322=\"\",\"\",MONTH(A322)),$P$3:$Q$14,2,FALSE),\"\")","v":"Styczeń"},{"$f":"WEEKNUM(Tabela14[[#This Row],[Data]],2)","v":3},{"$f":"IF(A322=\"\",\"\",YEAR(A322))","v":2018},{"$f":"G322","v":"Styczeń"}]
["2018-01-19","Zmiana A",545,100,6,19,"Styczeń",{"$f":"WEEKNUM(Tabela14[[#This Row],[Data]],2)","v":3},2018,"Styczeń"]
["2018-01-19","Zmiana A",307,95,18,19,"Styczeń",{"$f":"WEEKNUM(Tabela14[[#This Row],[Data]],2)","v":3},2018,"Styczeń"]
["2018-01-19","Zmiana A",22,207,251,19,"Styczeń",{"$f":"WEEKNUM(Tabela14[[#This Row],[Data]],2)","v":3},2018,"Styczeń"]
["2018-01-19","Zmiana A",197,51,3,19,"Styczeń",{"$f":"WEEKNUM(Tabela14[[#This Row],[Data]],2)","v":3},2018,"Styczeń"]
["2018-01-19","Zmiana A",917,58,25,19,"Styczeń",{"$f":"WEEKNUM(Tabela14[[#This Row],[Data]],2)","v":3},2018,"Styczeń"]
["2018-01-19","Zmiana A",326,2599,2406,19,"Styczeń",{"$f":"WEEKNUM(Tabela14[[#This Row],[Data]],2)","v":3},2018,"Styczeń"]
["2018-01-19","Zmiana A",2007977,200,260,19,"Styczeń",{"$f":"WEEKNUM(Tabela14[[#This Row],[Data]],2)","v":3},2018,"Styczeń"]
["2018-01-19","Zmiana A",780,38,18,19,"Styczeń",{"$f":"WEEKNUM(Tabela14[[#This Row],[Data]],2)","v":3},2018,"Styczeń"]
["2018-01-19","Zmiana A",791,14,10,19,"Styczeń",{"$f":"WEEKNUM(Tabela14[[#This Row],[Data]],2)","v":3},2018,"Styczeń"]
["2018-01-19","Zmiana B",791,20,30,19,"Styczeń",{"$f":"WEEKNUM(Tabela14[[#This Row],[Data]],2)","v":3},2018,"Styczeń"]
["2018-01-19","Zmiana B",845,318,20,19,"Styczeń",{"$f":"WEEKNUM(Tabela14[[#This Row],[Data]],2)","v":3},2018,"Styczeń"]
["2018-01-19","Zmiana B",896,303,25,19,"Styczeń",{"$f":"WEEKNUM(Tabela14[[#This Row],[Data]],2)","v":3},2018,"Styczeń"]
["2018-01-19","Zmiana B","33505F",47,97,19,"Styczeń",{"$f":"WEEKNUM(Tabela14[[#This Row],[Data]],2)","v":3},2018,"Styczeń"]
["2018-01-19","Zmiana B",119,537,600,19,"Styczeń",{"$f":"WEEKNUM(Tabela14[[#This Row],[Data]],2)","v":3},2018,"Styczeń"]
["2018-01-19","Zmiana A","33505F",218,5,19,"Styczeń",{"$f":"WEEKNUM(Tabela14[[#This Row],[Data]],2)","v":3},2018,"Styczeń"]
["2018-01-19","Zmiana A","33501F",295,23,19,"Styczeń",{"$f":"WEEKNUM(Tabela14[[#This Row],[Data]],2)","v":3},2018,"Styczeń"]
["2018-01-19","Zmiana A",643,94,24,19,"Styczeń",{"$f":"WEEKNUM(Tabela14[[#This Row],[Data]],2)","v":3},2018,"Styczeń"]
["2018-01-19","Zmiana A",319,48,20,19,"Styczeń",{"$f":"WEEKNUM(Tabela14[[#This Row],[Data]],2)","v":3},2018,"Styczeń"]
["2018-01-19","Zmiana A","33503F",532,500,19,"Styczeń",{"$f":"WEEKNUM(Tabela14[[#This Row],[Data]],2)","v":3},2018,"Styczeń"]
["2018-01-19","Zmiana A",2126381,42,50,19,"Styczeń",{"$f":"WEEKNUM(Tabela14[[#This Row],[Data]],2)","v":3},2018,"Styczeń"]
["2018-01-19","Zmiana A",545,251,6,19,"Styczeń",{"$f":"WEEKNUM(Tabela14[[#This Row],[Data]],2)","v":3},2018,"Styczeń"]
["2018-01-19","Zmiana A",307,57,18,19,"Styczeń",{"$f":"WEEKNUM(Tabela14[[#This Row],[Data]],2)","v":3},2018,"Styczeń"]
["2018-01-19","Zmiana A",22,503,251,19,"Styczeń",{"$f":"WEEKNUM(Tabela14[[#This Row],[Data]],2)","v":3},2018,"Styczeń"]
["2018-01-19","Zmiana A",197,55,3,19,"Styczeń",{"$f":"WEEKNUM(Tabela14[[#This Row],[Data]],2)","v":3},2018,"Styczeń"]
["2018-01-19","Zmiana A",917,282,25,19,"Styczeń",{"$f":"WEEKNUM(Tabela14[[#This Row],[Data]],2)","v":3},2018,"Styczeń"]
["2018-01-19","Zmiana A",326,2380,2406,19,"Styczeń",{"$f":"WEEKNUM(Tabela14[[#This Row],[Data]],2)","v":3},2018,"Styczeń"]
["2018-01-19","Zmiana A",2007977,511,260,19,"Styczeń",{"$f":"WEEKNUM(Tabela14[[#This Row],[Data]],2)","v":3},2018,"Styczeń"]
["2018-01-19","Zmiana A",780,213,18,19,"Styczeń",{"$f":"WEEKNUM(Tabela14[[#This Row],[Data]],2)","v":3},2018,"Styczeń"]
["2018-01-19","Zmiana A",791,260,10,19,"Styczeń",{"$f":"WEEKNUM(Tabela14[[#This Row],[Data]],2)","v":3},2018,"Styczeń"]
["2018-01-19","Zmiana C",326,314,399,19,"Styczeń",{"$f":"WEEKNUM(Tabela14[[#This Row],[Data]],2)","v":3},2018,"Styczeń"]
["2018-01-19","Zmiana C",498,2148,1982,19,"Styczeń",{"$f":"WEEKNUM(Tabela14[[#This Row],[Data]],2)","v":3},2018,"Styczeń"]
["2018-01-20","Zmiana A",888,122,10,20,"Styczeń",{"$f":"WEEKNUM(Tabela14[[#This Row],[Data]],2)","v":3},2018,"Styczeń"]
["2018-01-20","Zmiana A",812,1068,830,20,"Styczeń",{"$f":"WEEKNUM(Tabela14[[#This Row],[Data]],2)","v":3},2018,"Styczeń"]
["2018-01-20","Zmiana A",2451635,303,360,20,"Styczeń",{"$f":"WEEKNUM(Tabela14[[#This Row],[Data]],2)","v":3},2018,"Styczeń"]
["2018-01-20","Zmiana A",119,1393,1165,20,"Styczeń",{"$f":"WEEKNUM(Tabela14[[#This Row],[Data]],2)","v":3},2018,"Styczeń"]
["2018-01-20","Zmiana A",269,88,170,20,"Styczeń",{"$f":"WEEKNUM(Tabela14[[#This Row],[Data]],2)","v":3},2018,"Styczeń"]
["2018-01-20","Zmiana A",2001994,71,36,20,"Styczeń",{"$f":"WEEKNUM(Tabela14[[#This Row],[Data]],2)","v":3},2018,"Styczeń"]
["2018-01-20","Zmiana A",724,179,10,20,"Styczeń",{"$f":"WEEKNUM(Tabela14[[#This Row],[Data]],2)","v":3},2018,"Styczeń"]
["2018-01-20","Zmiana A",733,177,20,20,"Styczeń",{"$f":"WEEKNUM(Tabela14[[#This Row],[Data]],2)","v":3},2018,"Styczeń"]
["2018-01-22","Zmiana A",933,79,25,22,"Styczeń",{"$f":"WEEKNUM(Tabela14[[#This Row],[Data]],2)","v":4},2018,"Styczeń"]
["2018-01-22","Zmiana A",761,20,57,22,"Styczeń",{"$f":"WEEKNUM(Tabela14[[#This Row],[Data]],2)","v":4},2018,"Styczeń"]
["2018-01-22","Zmiana A",2035613,247,218,22,"Styczeń",{"$f":"WEEKNUM(Tabela14[[#This Row],[Data]],2)","v":4},2018,"Styczeń"]
["2018-01-22","Zmiana A",142,320,50,22,"Styczeń",{"$f":"WEEKNUM(Tabela14[[#This Row],[Data]],2)","v":4},2018,"Styczeń"]
["2018-01-22","Zmiana A",839,284,80,22,"Styczeń",{"$f":"WEEKNUM(Tabela14[[#This Row],[Data]],2)","v":4},2018,"Styczeń"]
["2018-01-22","Zmiana A",26144994,483,373,22,"Styczeń",{"$f":"WEEKNUM(Tabela14[[#This Row],[Data]],2)","v":4},2018,"Styczeń"]
["2018-01-22","Zmiana A",498,3018,2972,22,"Styczeń",{"$f":"WEEKNUM(Tabela14[[#This Row],[Data]],2)","v":4},2018,"Styczeń"]
["2018-01-22","Zmiana A",154,72,2,22,"Styczeń",{"$f":"WEEKNUM(Tabela14[[#This Row],[Data]],2)","v":4},2018,"Styczeń"]
["2018-01-22","Zmiana A",119,670,520,22,"Styczeń",{"$f":"WEEKNUM(Tabela14[[#This Row],[Data]],2)","v":4},2018,"Styczeń"]
["2018-01-22","Zmiana A",469,258,3,22,"Styczeń",{"$f":"WEEKNUM(Tabela14[[#This Row],[Data]],2)","v":4},2018,"Styczeń"]
["2018-01-22","Zmiana A",547,300,5,22,"Styczeń",{"$f":"WEEKNUM(Tabela14[[#This Row],[Data]],2)","v":4},2018,"Styczeń"]
["2018-01-22","Zmiana A",894,116,29,22,"Styczeń",{"$f":"WEEKNUM(Tabela14[[#This Row],[Data]],2)","v":4},2018,"Styczeń"]
["2018-01-22","Zmiana A",888,239,6,22,"Styczeń",{"$f":"WEEKNUM(Tabela14[[#This Row],[Data]],2)","v":4},2018,"Styczeń"]
["2018-01-22","Zmiana A",812,1362,1082,22,"Styczeń",{"$f":"WEEKNUM(Tabela14[[#This Row],[Data]],2)","v":4},2018,"Styczeń"]
["2018-01-22","Zmiana A",780,50,40,22,"Styczeń",{"$f":"WEEKNUM(Tabela14[[#This Row],[Data]],2)","v":4},2018,"Styczeń"]
["2018-01-22","Zmiana A",791,231,60,22,"Styczeń",{"$f":"WEEKNUM(Tabela14[[#This Row],[Data]],2)","v":4},2018,"Styczeń"]
["2018-01-22","Zmiana B",845,163,40,22,"Styczeń",{"$f":"WEEKNUM(Tabela14[[#This Row],[Data]],2)","v":4},2018,"Styczeń"]
["2018-01-22","Zmiana B",894,181,200,22,"Styczeń",{"$f":"WEEKNUM(Tabela14[[#This Row],[Data]],2)","v":4},2018,"Styczeń"]
["2018-01-22","Zmiana B",560,533,370,22,"Styczeń",{"$f":"WEEKNUM(Tabela14[[#This Row],[Data]],2)","v":4},2018,"Styczeń"]
["2018-01-22","Zmiana B",2451636,491,230,22,"Styczeń",{"$f":"WEEKNUM(Tabela14[[#This Row],[Data]],2)","v":4},2018,"Styczeń"]
["2018-01-22","Zmiana B",787,405,280,22,"Styczeń",{"$f":"WEEKNUM(Tabela14[[#This Row],[Data]],2)","v":4},2018,"Styczeń"]
["2018-01-22","Zmiana B",571,873,657,22,"Styczeń",{"$f":"WEEKNUM(Tabela14[[#This Row],[Data]],2)","v":4},2018,"Styczeń"]
["2018-01-22","Zmiana C",791,374,160,22,"Styczeń",{"$f":"WEEKNUM(Tabela14[[#This Row],[Data]],2)","v":4},2018,"Styczeń"]
["2018-01-22","Zmiana C",787,224,87,22,"Styczeń",{"$f":"WEEKNUM(Tabela14[[#This Row],[Data]],2)","v":4},2018,"Styczeń"]
["2018-01-22","Zmiana C",780,268,58,{"$f":"IF(A386=\"\",\"\",DAY(A386))","v":22},{"$f":"IFERROR(VLOOKUP(IF(A386=\"\",\"\",MONTH(A386)),$P$3:$Q$14,2,FALSE),\"\")","v":"Styczeń"},{"$f":"WEEKNUM(Tabela14[[#This Row],[Data]],2)","v":4},{"$f":"IF(A386=\"\",\"\",YEAR(A386))","v":2018},{"$f":"G386","v":"Styczeń"}]
["2018-01-22","Zmiana C",26144994,1363,1144,22,"Styczeń",{"$f":"WEEKNUM(Tabela14[[#This Row],[Data]],2)","v":4},2018,"Styczeń"]
["2018-01-22","Zmiana C",326,1100,1198,22,"Styczeń",{"$f":"WEEKNUM(Tabela14[[#This Row],[Data]],2)","v":4},2018,"Styczeń"]
["2018-01-22","Zmiana C",575,548,271,22,"Styczeń",{"$f":"WEEKNUM(Tabela14[[#This Row],[Data]],2)","v":4},2018,"Styczeń"]
["2018-01-23","Zmiana A",891,1833,1600,23,"Styczeń",{"$f":"WEEKNUM(Tabela14[[#This Row],[Data]],2)","v":4},2018,"Styczeń"]
["2018-01-23","Zmiana A",95,1112,1000,23,"Styczeń",{"$f":"WEEKNUM(Tabela14[[#This Row],[Data]],2)","v":4},2018,"Styczeń"]
["2018-01-23","Zmiana A","300F",31,74,23,"Styczeń",{"$f":"WEEKNUM(Tabela14[[#This Row],[Data]],2)","v":4},2018,"Styczeń"]
["2018-01-23","Zmiana A",326,590,588,23,"Styczeń",{"$f":"WEEKNUM(Tabela14[[#This Row],[Data]],2)","v":4},2018,"Styczeń"]
["2018-01-23","Zmiana A",498,2289,2386,23,"Styczeń",{"$f":"WEEKNUM(Tabela14[[#This Row],[Data]],2)","v":4},2018,"Styczeń"]
["2018-01-23","Zmiana A","721F",396,350,23,"Styczeń",{"$f":"WEEKNUM(Tabela14[[#This Row],[Data]],2)","v":4},2018,"Styczeń"]
["2018-01-23","Zmiana A",2009613,30,20,23,"Styczeń",{"$f":"WEEKNUM(Tabela14[[#This Row],[Data]],2)","v":4},2018,"Styczeń"]
["2018-01-23","Zmiana A",888,130,75,23,"Styczeń",{"$f":"WEEKNUM(Tabela14[[#This Row],[Data]],2)","v":4},2018,"Styczeń"]
["2018-01-23","Zmiana A",513,329,75,23,"Styczeń",{"$f":"WEEKNUM(Tabela14[[#This Row],[Data]],2)","v":4},2018,"Styczeń"]
["2018-01-23","Zmiana A",575,589,525,23,"Styczeń",{"$f":"WEEKNUM(Tabela14[[#This Row],[Data]],2)","v":4},2018,"Styczeń"]
["2018-01-23","Zmiana A","717F",818,576,23,"Styczeń",{"$f":"WEEKNUM(Tabela14[[#This Row],[Data]],2)","v":4},2018,"Styczeń"]
["2018-01-23","Zmiana B",944,128,10,23,"Styczeń",{"$f":"WEEKNUM(Tabela14[[#This Row],[Data]],2)","v":4},2018,"Styczeń"]
["2018-01-23","Zmiana B",799,18,16,23,"Styczeń",{"$f":"WEEKNUM(Tabela14[[#This Row],[Data]],2)","v":4},2018,"Styczeń"]
["2018-01-23","Zmiana B",570,477,250,23,"Styczeń",{"$f":"WEEKNUM(Tabela14[[#This Row],[Data]],2)","v":4},2018,"Styczeń"]
["2018-01-23","Zmiana B",2310044,500,480,23,"Styczeń",{"$f":"WEEKNUM(Tabela14[[#This Row],[Data]],2)","v":4},2018,"Styczeń"]
["2018-01-23","Zmiana B",2297015,570,650,23,"Styczeń",{"$f":"WEEKNUM(Tabela14[[#This Row],[Data]],2)","v":4},2018,"Styczeń"]
["2018-01-23","Zmiana C",179,1118,933,23,"Styczeń",{"$f":"WEEKNUM(Tabela14[[#This Row],[Data]],2)","v":4},2018,"Styczeń"]
["2018-01-23","Zmiana C",780,106,160,23,"Styczeń",{"$f":"WEEKNUM(Tabela14[[#This Row],[Data]],2)","v":4},2018,"Styczeń"]
["2018-01-23","Zmiana C",933,67,150,23,"Styczeń",{"$f":"WEEKNUM(Tabela14[[#This Row],[Data]],2)","v":4},2018,"Styczeń"]
["2018-01-23","Zmiana C",26144994,448,380,23,"Styczeń",{"$f":"WEEKNUM(Tabela14[[#This Row],[Data]],2)","v":4},2018,"Styczeń"]
["2018-01-23","Zmiana C",326,2171,1992,23,"Styczeń",{"$f":"WEEKNUM(Tabela14[[#This Row],[Data]],2)","v":4},2018,"Styczeń"]
["2018-01-24","Zmiana A","334F",1113,1000,24,"Styczeń",{"$f":"WEEKNUM(Tabela14[[#This Row],[Data]],2)","v":4},2018,"Styczeń"]
["2018-01-24","Zmiana A",2408708,374,168,24,"Styczeń",{"$f":"WEEKNUM(Tabela14[[#This Row],[Data]],2)","v":4},2018,"Styczeń"]
["2018-01-24","Zmiana A",2435318,153,20,24,"Styczeń",{"$f":"WEEKNUM(Tabela14[[#This Row],[Data]],2)","v":4},2018,"Styczeń"]
["2018-01-24","Zmiana A",1533713,141,33,24,"Styczeń",{"$f":"WEEKNUM(Tabela14[[#This Row],[Data]],2)","v":4},2018,"Styczeń"]
["2018-01-24","Zmiana A","33501F",303,250,24,"Styczeń",{"$f":"WEEKNUM(Tabela14[[#This Row],[Data]],2)","v":4},2018,"Styczeń"]
["2018-01-24","Zmiana A",799,253,10,24,"Styczeń",{"$f":"WEEKNUM(Tabela14[[#This Row],[Data]],2)","v":4},2018,"Styczeń"]
["2018-01-24","Zmiana A",514,14,15,24,"Styczeń",{"$f":"WEEKNUM(Tabela14[[#This Row],[Data]],2)","v":4},2018,"Styczeń"]
["2018-01-24","Zmiana A",1880156,77,83,24,"Styczeń",{"$f":"WEEKNUM(Tabela14[[#This Row],[Data]],2)","v":4},2018,"Styczeń"]
["2018-01-24","Zmiana A",498,3069,2997,24,"Styczeń",{"$f":"WEEKNUM(Tabela14[[#This Row],[Data]],2)","v":4},2018,"Styczeń"]
["2018-01-24","Zmiana A","717F",628,368,24,"Styczeń",{"$f":"WEEKNUM(Tabela14[[#This Row],[Data]],2)","v":4},2018,"Styczeń"]
["2018-01-24","Zmiana B",996,232,27,24,"Styczeń",{"$f":"WEEKNUM(Tabela14[[#This Row],[Data]],2)","v":4},2018,"Styczeń"]
["2018-01-24","Zmiana B",1533713,47,23,24,"Styczeń",{"$f":"WEEKNUM(Tabela14[[#This Row],[Data]],2)","v":4},2018,"Styczeń"]
["2018-01-24","Zmiana B",356,37,37,24,"Styczeń",{"$f":"WEEKNUM(Tabela14[[#This Row],[Data]],2)","v":4},2018,"Styczeń"]
["2018-01-24","Zmiana B",787,336,255,24,"Styczeń",{"$f":"WEEKNUM(Tabela14[[#This Row],[Data]],2)","v":4},2018,"Styczeń"]
["2018-01-24","Zmiana B",179,289,32,24,"Styczeń",{"$f":"WEEKNUM(Tabela14[[#This Row],[Data]],2)","v":4},2018,"Styczeń"]
["2018-01-24","Zmiana B",160,132,229,24,"Styczeń",{"$f":"WEEKNUM(Tabela14[[#This Row],[Data]],2)","v":4},2018,"Styczeń"]
["2018-01-24","Zmiana B",2432300,784,789,24,"Styczeń",{"$f":"WEEKNUM(Tabela14[[#This Row],[Data]],2)","v":4},2018,"Styczeń"]
["2018-01-24","Zmiana B",844,313,80,24,"Styczeń",{"$f":"WEEKNUM(Tabela14[[#This Row],[Data]],2)","v":4},2018,"Styczeń"]
["2018-01-24","Zmiana B",198,696,400,24,"Styczeń",{"$f":"WEEKNUM(Tabela14[[#This Row],[Data]],2)","v":4},2018,"Styczeń"]
["2018-01-24","Zmiana B",543,240,9,24,"Styczeń",{"$f":"WEEKNUM(Tabela14[[#This Row],[Data]],2)","v":4},2018,"Styczeń"]
["2018-01-24","Zmiana B",726,363,320,24,"Styczeń",{"$f":"WEEKNUM(Tabela14[[#This Row],[Data]],2)","v":4},2018,"Styczeń"]
["2018-01-24","Zmiana B",891,523,320,24,"Styczeń",{"$f":"WEEKNUM(Tabela14[[#This Row],[Data]],2)","v":4},2018,"Styczeń"]
["2018-01-25","Zmiana A","713F",392,120,25,"Styczeń",{"$f":"WEEKNUM(Tabela14[[#This Row],[Data]],2)","v":4},2018,"Styczeń"]
["2018-01-25","Zmiana A",933,591,300,25,"Styczeń",{"$f":"WEEKNUM(Tabela14[[#This Row],[Data]],2)","v":4},2018,"Styczeń"]
["2018-01-25","Zmiana A",498,1531,1599,25,"Styczeń",{"$f":"WEEKNUM(Tabela14[[#This Row],[Data]],2)","v":4},2018,"Styczeń"]
["2018-01-25","Zmiana A",26144994,71,41,25,"Styczeń",{"$f":"WEEKNUM(Tabela14[[#This Row],[Data]],2)","v":4},2018,"Styczeń"]
["2018-01-25","Zmiana A",2067417,138,10,25,"Styczeń",{"$f":"WEEKNUM(Tabela14[[#This Row],[Data]],2)","v":4},2018,"Styczeń"]
["2018-01-25","Zmiana A",416,88,10,25,"Styczeń",{"$f":"WEEKNUM(Tabela14[[#This Row],[Data]],2)","v":4},2018,"Styczeń"]
["2018-01-25","Zmiana A",958,45,14,25,"Styczeń",{"$f":"WEEKNUM(Tabela14[[#This Row],[Data]],2)","v":4},2018,"Styczeń"]
["2018-01-25","Zmiana A",414,284,10,25,"Styczeń",{"$f":"WEEKNUM(Tabela14[[#This Row],[Data]],2)","v":4},2018,"Styczeń"]
["2018-01-25","Zmiana A",701,10,4,25,"Styczeń",{"$f":"WEEKNUM(Tabela14[[#This Row],[Data]],2)","v":4},2018,"Styczeń"]
["2018-01-25","Zmiana A",162,224,6,25,"Styczeń",{"$f":"WEEKNUM(Tabela14[[#This Row],[Data]],2)","v":4},2018,"Styczeń"]
["2018-01-25","Zmiana A","334F",1728,1487,25,"Styczeń",{"$f":"WEEKNUM(Tabela14[[#This Row],[Data]],2)","v":4},2018,"Styczeń"]
["2018-01-25","Zmiana A",812,529,508,25,"Styczeń",{"$f":"WEEKNUM(Tabela14[[#This Row],[Data]],2)","v":4},2018,"Styczeń"]
["2018-01-25","Zmiana A",97,35,60,25,"Styczeń",{"$f":"WEEKNUM(Tabela14[[#This Row],[Data]],2)","v":4},2018,"Styczeń"]
["2018-01-25","Zmiana A","346F",251,120,25,"Styczeń",{"$f":"WEEKNUM(Tabela14[[#This Row],[Data]],2)","v":4},2018,"Styczeń"]
["2018-01-25","Zmiana B",198,144,200,25,"Styczeń",{"$f":"WEEKNUM(Tabela14[[#This Row],[Data]],2)","v":4},2018,"Styczeń"]
["2018-01-25","Zmiana B",252,447,243,25,"Styczeń",{"$f":"WEEKNUM(Tabela14[[#This Row],[Data]],2)","v":4},2018,"Styczeń"]
["2018-01-25","Zmiana B",358,867,600,25,"Styczeń",{"$f":"WEEKNUM(Tabela14[[#This Row],[Data]],2)","v":4},2018,"Styczeń"]
["2018-01-25","Zmiana B",996,551,400,{"$f":"IF(A450=\"\",\"\",DAY(A450))","v":25},{"$f":"IFERROR(VLOOKUP(IF(A450=\"\",\"\",MONTH(A450)),$P$3:$Q$14,2,FALSE),\"\")","v":"Styczeń"},{"$f":"WEEKNUM(Tabela14[[#This Row],[Data]],2)","v":4},{"$f":"IF(A450=\"\",\"\",YEAR(A450))","v":2018},{"$f":"G450","v":"Styczeń"}]
["2018-01-25","Zmiana B",761,231,80,25,"Styczeń",{"$f":"WEEKNUM(Tabela14[[#This Row],[Data]],2)","v":4},2018,"Styczeń"]
["2018-01-25","Zmiana B",2310044,209,264,25,"Styczeń",{"$f":"WEEKNUM(Tabela14[[#This Row],[Data]],2)","v":4},2018,"Styczeń"]
["2018-01-25","Zmiana B",2451635,362,360,25,"Styczeń",{"$f":"WEEKNUM(Tabela14[[#This Row],[Data]],2)","v":4},2018,"Styczeń"]
["2018-01-26","Zmiana C",326,2129,1994,26,"Styczeń",{"$f":"WEEKNUM(Tabela14[[#This Row],[Data]],2)","v":4},2018,"Styczeń"]
["2018-01-26","Zmiana C",26144994,497,378,26,"Styczeń",{"$f":"WEEKNUM(Tabela14[[#This Row],[Data]],2)","v":4},2018,"Styczeń"]
["2018-01-26","Zmiana C",498,2167,1997,26,"Styczeń",{"$f":"WEEKNUM(Tabela14[[#This Row],[Data]],2)","v":4},2018,"Styczeń"]
["2018-01-26","Zmiana C",26144994,523,364,26,"Styczeń",{"$f":"WEEKNUM(Tabela14[[#This Row],[Data]],2)","v":4},2018,"Styczeń"]
["2018-01-26","Zmiana B",845,30,20,26,"Styczeń",{"$f":"WEEKNUM(Tabela14[[#This Row],[Data]],2)","v":4},2018,"Styczeń"]
["2018-01-26","Zmiana B",1533713,399,359,26,"Styczeń",{"$f":"WEEKNUM(Tabela14[[#This Row],[Data]],2)","v":4},2018,"Styczeń"]
["2018-01-26","Zmiana B",2451636,534,480,26,"Styczeń",{"$f":"WEEKNUM(Tabela14[[#This Row],[Data]],2)","v":4},2018,"Styczeń"]
["2018-01-27","Zmiana A",693,5224,5133,27,"Styczeń",{"$f":"WEEKNUM(Tabela14[[#This Row],[Data]],2)","v":4},2018,"Styczeń"]
["2018-01-27","Zmiana A","s122309",690,450,27,"Styczeń",{"$f":"WEEKNUM(Tabela14[[#This Row],[Data]],2)","v":4},2018,"Styczeń"]
["2018-01-27","Zmiana A",634,591,400,27,"Styczeń",{"$f":"WEEKNUM(Tabela14[[#This Row],[Data]],2)","v":4},2018,"Styczeń"]
["2018-01-27","Zmiana A",119,964,1000,27,"Styczeń",{"$f":"WEEKNUM(Tabela14[[#This Row],[Data]],2)","v":4},2018,"Styczeń"]
["2018-01-27","Zmiana A",76,636,388,27,"Styczeń",{"$f":"WEEKNUM(Tabela14[[#This Row],[Data]],2)","v":4},2018,"Styczeń"]
["2018-01-29","Zmiana A","705F",273,28,29,"Styczeń",{"$f":"WEEKNUM(Tabela14[[#This Row],[Data]],2)","v":5},2018,"Styczeń"]
["2018-01-29","Zmiana A",2297015,223,169,29,"Styczeń",{"$f":"WEEKNUM(Tabela14[[#This Row],[Data]],2)","v":5},2018,"Styczeń"]
["2018-01-29","Zmiana A",1880156,243,24,29,"Styczeń",{"$f":"WEEKNUM(Tabela14[[#This Row],[Data]],2)","v":5},2018,"Styczeń"]
["2018-01-29","Zmiana A",437,244,49,29,"Styczeń",{"$f":"WEEKNUM(Tabela14[[#This Row],[Data]],2)","v":5},2018,"Styczeń"]
["2018-01-29","Zmiana A","717F",771,496,29,"Styczeń",{"$f":"WEEKNUM(Tabela14[[#This Row],[Data]],2)","v":5},2018,"Styczeń"]
["2018-01-29","Zmiana A","722F",90,105,29,"Styczeń",{"$f":"WEEKNUM(Tabela14[[#This Row],[Data]],2)","v":5},2018,"Styczeń"]
["2018-01-29","Zmiana A",2030723,2766,2670,29,"Styczeń",{"$f":"WEEKNUM(Tabela14[[#This Row],[Data]],2)","v":5},2018,"Styczeń"]
["2018-01-29","Zmiana A",197,143,3,29,"Styczeń",{"$f":"WEEKNUM(Tabela14[[#This Row],[Data]],2)","v":5},2018,"Styczeń"]
["2018-01-29","Zmiana A",502,9,84,29,"Styczeń",{"$f":"WEEKNUM(Tabela14[[#This Row],[Data]],2)","v":5},2018,"Styczeń"]
["2018-01-29","Zmiana A",498,2747,2790,29,"Styczeń",{"$f":"WEEKNUM(Tabela14[[#This Row],[Data]],2)","v":5},2018,"Styczeń"]
["2018-01-29","Zmiana A",2334641,541,288,29,"Styczeń",{"$f":"WEEKNUM(Tabela14[[#This Row],[Data]],2)","v":5},2018,"Styczeń"]
["2018-01-29","Zmiana A",839,184,250,29,"Styczeń",{"$f":"WEEKNUM(Tabela14[[#This Row],[Data]],2)","v":5},2018,"Styczeń"]
["2018-01-29","Zmiana B",198,334,400,29,"Styczeń",{"$f":"WEEKNUM(Tabela14[[#This Row],[Data]],2)","v":5},2018,"Styczeń"]
["2018-01-29","Zmiana B",746,295,40,29,"Styczeń",{"$f":"WEEKNUM(Tabela14[[#This Row],[Data]],2)","v":5},2018,"Styczeń"]
["2018-01-29","Zmiana B",2418976,338,108,29,"Styczeń",{"$f":"WEEKNUM(Tabela14[[#This Row],[Data]],2)","v":5},2018,"Styczeń"]
["2018-01-29","Zmiana B",2418977,57,72,29,"Styczeń",{"$f":"WEEKNUM(Tabela14[[#This Row],[Data]],2)","v":5},2018,"Styczeń"]
["2018-01-29","Zmiana B",791,188,20,29,"Styczeń",{"$f":"WEEKNUM(Tabela14[[#This Row],[Data]],2)","v":5},2018,"Styczeń"]
["2018-01-29","Zmiana B",2310044,656,552,29,"Styczeń",{"$f":"WEEKNUM(Tabela14[[#This Row],[Data]],2)","v":5},2018,"Styczeń"]
["2018-01-29","Zmiana C",812,940,966,29,"Styczeń",{"$f":"WEEKNUM(Tabela14[[#This Row],[Data]],2)","v":5},2018,"Styczeń"]
["2018-01-29","Zmiana C",780,235,82,29,"Styczeń",{"$f":"WEEKNUM(Tabela14[[#This Row],[Data]],2)","v":5},2018,"Styczeń"]
["2018-01-29","Zmiana C",791,55,140,29,"Styczeń",{"$f":"WEEKNUM(Tabela14[[#This Row],[Data]],2)","v":5},2018,"Styczeń"]
["2018-01-29","Zmiana C",26144994,1025,748,29,"Styczeń",{"$f":"WEEKNUM(Tabela14[[#This Row],[Data]],2)","v":5},2018,"Styczeń"]
["2018-01-29","Zmiana C",326,1712,1596,29,"Styczeń",{"$f":"WEEKNUM(Tabela14[[#This Row],[Data]],2)","v":5},2018,"Styczeń"]
["2018-01-29","Zmiana C",310,205,110,29,"Styczeń",{"$f":"WEEKNUM(Tabela14[[#This Row],[Data]],2)","v":5},2018,"Styczeń"]
["2018-01-30","Zmiana A",2149709,290,131,30,"Styczeń",{"$f":"WEEKNUM(Tabela14[[#This Row],[Data]],2)","v":5},2018,"Styczeń"]
["2018-01-30","Zmiana A",2375097,133,96,30,"Styczeń",{"$f":"WEEKNUM(Tabela14[[#This Row],[Data]],2)","v":5},2018,"Styczeń"]
["2018-01-30","Zmiana A",894,450,240,30,"Styczeń",{"$f":"WEEKNUM(Tabela14[[#This Row],[Data]],2)","v":5},2018,"Styczeń"]
["2018-01-30","Zmiana A",2007977,490,220,30,"Styczeń",{"$f":"WEEKNUM(Tabela14[[#This Row],[Data]],2)","v":5},2018,"Styczeń"]
["2018-01-30","Zmiana A",319,278,20,30,"Styczeń",{"$f":"WEEKNUM(Tabela14[[#This Row],[Data]],2)","v":5},2018,"Styczeń"]
["2018-01-30","Zmiana A","716f",607,624,30,"Styczeń",{"$f":"WEEKNUM(Tabela14[[#This Row],[Data]],2)","v":5},2018,"Styczeń"]
["2018-01-30","Zmiana A",1901726,216,19,30,"Styczeń",{"$f":"WEEKNUM(Tabela14[[#This Row],[Data]],2)","v":5},2018,"Styczeń"]
["2018-01-30","Zmiana A","718F",316,30,30,"Styczeń",{"$f":"WEEKNUM(Tabela14[[#This Row],[Data]],2)","v":5},2018,"Styczeń"]
["2018-01-30","Zmiana A",514,3,15,30,"Styczeń",{"$f":"WEEKNUM(Tabela14[[#This Row],[Data]],2)","v":5},2018,"Styczeń"]
["2018-01-30","Zmiana A",701,294,4,30,"Styczeń",{"$f":"WEEKNUM(Tabela14[[#This Row],[Data]],2)","v":5},2018,"Styczeń"]
["2018-01-30","Zmiana A",476,25,71,30,"Styczeń",{"$f":"WEEKNUM(Tabela14[[#This Row],[Data]],2)","v":5},2018,"Styczeń"]
["2018-01-30","Zmiana A",2030723,514,500,30,"Styczeń",{"$f":"WEEKNUM(Tabela14[[#This Row],[Data]],2)","v":5},2018,"Styczeń"]
["2018-01-30","Zmiana A",326,3140,2872,30,"Styczeń",{"$f":"WEEKNUM(Tabela14[[#This Row],[Data]],2)","v":5},2018,"Styczeń"]
["2018-01-30","Zmiana B",617,42,2,30,"Styczeń",{"$f":"WEEKNUM(Tabela14[[#This Row],[Data]],2)","v":5},2018,"Styczeń"]
["2018-01-30","Zmiana B",437,363,245,30,"Styczeń",{"$f":"WEEKNUM(Tabela14[[#This Row],[Data]],2)","v":5},2018,"Styczeń"]
["2018-01-30","Zmiana B",845,3,24,30,"Styczeń",{"$f":"WEEKNUM(Tabela14[[#This Row],[Data]],2)","v":5},2018,"Styczeń"]
["2018-01-30","Zmiana B",179,1017,911,30,"Styczeń",{"$f":"WEEKNUM(Tabela14[[#This Row],[Data]],2)","v":5},2018,"Styczeń"]
["2018-01-30","Zmiana B",2296305,788,550,30,"Styczeń",{"$f":"WEEKNUM(Tabela14[[#This Row],[Data]],2)","v":5},2018,"Styczeń"]
["2018-01-30","Zmiana C",514,434,180,30,"Styczeń",{"$f":"WEEKNUM(Tabela14[[#This Row],[Data]],2)","v":5},2018,"Styczeń"]
["2018-01-30","Zmiana C",513,153,10,30,"Styczeń",{"$f":"WEEKNUM(Tabela14[[#This Row],[Data]],2)","v":5},2018,"Styczeń"]
["2018-01-30","Zmiana C",356,405,400,30,"Styczeń",{"$f":"WEEKNUM(Tabela14[[#This Row],[Data]],2)","v":5},2018,"Styczeń"]
["2018-01-30","Zmiana C",2432300,851,800,30,"Styczeń",{"$f":"WEEKNUM(Tabela14[[#This Row],[Data]],2)","v":5},2018,"Styczeń"]
["2018-01-30","Zmiana C",933,152,250,30,"Styczeń",{"$f":"WEEKNUM(Tabela14[[#This Row],[Data]],2)","v":5},2018,"Styczeń"]
["2018-01-30","Zmiana C",26144994,1113,1131,30,"Styczeń",{"$f":"WEEKNUM(Tabela14[[#This Row],[Data]],2)","v":5},2018,"Styczeń"]
["2018-01-30","Zmiana C",498,1169,1200,{"$f":"IF(A514=\"\",\"\",DAY(A514))","v":30},{"$f":"IFERROR(VLOOKUP(IF(A514=\"\",\"\",MONTH(A514)),$P$3:$Q$14,2,FALSE),\"\")","v":"Styczeń"},{"$f":"WEEKNUM(Tabela14[[#This Row],[Data]],2)","v":5},{"$f":"IF(A514=\"\",\"\",YEAR(A514))","v":2018},{"$f":"G514","v":"Styczeń"}]
["2018-01-30","Zmiana C",817,219,8,30,"Styczeń",{"$f":"WEEKNUM(Tabela14[[#This Row],[Data]],2)","v":5},2018,"Styczeń"]
["2018-01-31","Zmiana A",701,84,4,31,"Styczeń",{"$f":"WEEKNUM(Tabela14[[#This Row],[Data]],2)","v":5},2018,"Styczeń"]
["2018-01-31","Zmiana A",560,136,88,31,"Styczeń",{"$f":"WEEKNUM(Tabela14[[#This Row],[Data]],2)","v":5},2018,"Styczeń"]
["2018-01-31","Zmiana A",2334641,342,74,31,"Styczeń",{"$f":"WEEKNUM(Tabela14[[#This Row],[Data]],2)","v":5},2018,"Styczeń"]
["2018-01-31","Zmiana A","721F",276,210,31,"Styczeń",{"$f":"WEEKNUM(Tabela14[[#This Row],[Data]],2)","v":5},2018,"Styczeń"]
["2018-01-31","Zmiana A","33501F",212,250,31,"Styczeń",{"$f":"WEEKNUM(Tabela14[[#This Row],[Data]],2)","v":5},2018,"Styczeń"]
["2018-01-31","Zmiana A",197,275,3,31,"Styczeń",{"$f":"WEEKNUM(Tabela14[[#This Row],[Data]],2)","v":5},2018,"Styczeń"]
["2018-01-31","Zmiana A",2149709,193,24,31,"Styczeń",{"$f":"WEEKNUM(Tabela14[[#This Row],[Data]],2)","v":5},2018,"Styczeń"]
["2018-01-31","Zmiana A",958,273,12,31,"Styczeń",{"$f":"WEEKNUM(Tabela14[[#This Row],[Data]],2)","v":5},2018,"Styczeń"]
["2018-01-31","Zmiana A",554,61,10,31,"Styczeń",{"$f":"WEEKNUM(Tabela14[[#This Row],[Data]],2)","v":5},2018,"Styczeń"]
["2018-01-31","Zmiana A","33501F",352,240,31,"Styczeń",{"$f":"WEEKNUM(Tabela14[[#This Row],[Data]],2)","v":5},2018,"Styczeń"]
["2018-01-31","Zmiana A",498,2755,2779,31,"Styczeń",{"$f":"WEEKNUM(Tabela14[[#This Row],[Data]],2)","v":5},2018,"Styczeń"]
["2018-01-31","Zmiana A",708,316,372,31,"Styczeń",{"$f":"WEEKNUM(Tabela14[[#This Row],[Data]],2)","v":5},2018,"Styczeń"]
["2018-01-31","Zmiana A","33503F",229,130,31,"Styczeń",{"$f":"WEEKNUM(Tabela14[[#This Row],[Data]],2)","v":5},2018,"Styczeń"]
["2018-01-31","Zmiana A",700,52,20,31,"Styczeń",{"$f":"WEEKNUM(Tabela14[[#This Row],[Data]],2)","v":5},2018,"Styczeń"]
["2018-01-31","Zmiana A",702,115,15,31,"Styczeń",{"$f":"WEEKNUM(Tabela14[[#This Row],[Data]],2)","v":5},2018,"Styczeń"]
["2018-01-31","Zmiana B","33505F",159,110,31,"Styczeń",{"$f":"WEEKNUM(Tabela14[[#This Row],[Data]],2)","v":5},2018,"Styczeń"]
["2018-01-31","Zmiana B",708,60,72,31,"Styczeń",{"$f":"WEEKNUM(Tabela14[[#This Row],[Data]],2)","v":5},2018,"Styczeń"]
["2018-01-31","Zmiana B",202,482,192,31,"Styczeń",{"$f":"WEEKNUM(Tabela14[[#This Row],[Data]],2)","v":5},2018,"Styczeń"]
["2018-01-31","Zmiana B",543,295,195,31,"Styczeń",{"$f":"WEEKNUM(Tabela14[[#This Row],[Data]],2)","v":5},2018,"Styczeń"]
["2018-01-31","Zmiana B",31,34,123,31,"Styczeń",{"$f":"WEEKNUM(Tabela14[[#This Row],[Data]],2)","v":5},2018,"Styczeń"]
["2018-01-31","Zmiana B",513,221,135,31,"Styczeń",{"$f":"WEEKNUM(Tabela14[[#This Row],[Data]],2)","v":5},2018,"Styczeń"]
["2018-01-31","Zmiana B",119,494,360,31,"Styczeń",{"$f":"WEEKNUM(Tabela14[[#This Row],[Data]],2)","v":5},2018,"Styczeń"]
["2018-01-31","Zmiana B",2451636,172,135,31,"Styczeń",{"$f":"WEEKNUM(Tabela14[[#This Row],[Data]],2)","v":5},2018,"Styczeń"]
["2018-01-31","Zmiana B",787,445,462,31,"Styczeń",{"$f":"WEEKNUM(Tabela14[[#This Row],[Data]],2)","v":5},2018,"Styczeń"]
["2018-01-31","Zmiana C",2408709,78,120,31,"Styczeń",{"$f":"WEEKNUM(Tabela14[[#This Row],[Data]],2)","v":5},2018,"Styczeń"]
["2018-01-31","Zmiana C",812,935,821,31,"Styczeń",{"$f":"WEEKNUM(Tabela14[[#This Row],[Data]],2)","v":5},2018,"Styczeń"]
["2018-01-31","Zmiana C",2451636,390,405,31,"Styczeń",{"$f":"WEEKNUM(Tabela14[[#This Row],[Data]],2)","v":5},2018,"Styczeń"]
["2018-01-31","Zmiana C",26144994,704,756,31,"Styczeń",{"$f":"WEEKNUM(Tabela14[[#This Row],[Data]],2)","v":5},2018,"Styczeń"]
["2018-01-31","Zmiana C",326,1483,1559,31,"Styczeń",{"$f":"WEEKNUM(Tabela14[[#This Row],[Data]],2)","v":5},2018,"Styczeń"]
["2018-01-31","Zmiana C",1745895,72,14,31,"Styczeń",{"$f":"WEEKNUM(Tabela14[[#This Row],[Data]],2)","v":5},2018,"Styczeń"]
["2018-01-31","Zmiana C",2001994,81,18,31,"Styczeń",{"$f":"WEEKNUM(Tabela14[[#This Row],[Data]],2)","v":5},2018,"Styczeń"]
["2018-01-31","Zmiana C",817,74,8,31,"Styczeń",{"$f":"WEEKNUM(Tabela14[[#This Row],[Data]],2)","v":5},2018,"Styczeń"]
["2018-02-01","Zmiana A","722F",117,210,1,"Luty",{"$f":"WEEKNUM(Tabela14[[#This Row],[Data]],2)","v":5},2018,"Luty"]
["2018-02-01","Zmiana A","708F",590,312,1,"Luty",{"$f":"WEEKNUM(Tabela14[[#This Row],[Data]],2)","v":5},2018,"Luty"]
["2018-02-01","Zmiana A",634,28,4,1,"Luty",{"$f":"WEEKNUM(Tabela14[[#This Row],[Data]],2)","v":5},2018,"Luty"]
["2018-02-01","Zmiana A","711F",416,200,1,"Luty",{"$f":"WEEKNUM(Tabela14[[#This Row],[Data]],2)","v":5},2018,"Luty"]
["2018-02-01","Zmiana A",15,685,468,1,"Luty",{"$f":"WEEKNUM(Tabela14[[#This Row],[Data]],2)","v":5},2018,"Luty"]
["2018-02-01","Zmiana A","721F",390,144,1,"Luty",{"$f":"WEEKNUM(Tabela14[[#This Row],[Data]],2)","v":5},2018,"Luty"]
["2018-02-01","Zmiana A",414,7,10,1,"Luty",{"$f":"WEEKNUM(Tabela14[[#This Row],[Data]],2)","v":5},2018,"Luty"]
["2018-02-01","Zmiana A",318,199,20,1,"Luty",{"$f":"WEEKNUM(Tabela14[[#This Row],[Data]],2)","v":5},2018,"Luty"]
["2018-02-01","Zmiana A",2494417,245,100,1,"Luty",{"$f":"WEEKNUM(Tabela14[[#This Row],[Data]],2)","v":5},2018,"Luty"]
["2018-02-01","Zmiana A",326,2440,2186,1,"Luty",{"$f":"WEEKNUM(Tabela14[[#This Row],[Data]],2)","v":5},2018,"Luty"]
["2018-02-01","Zmiana A",643,291,26,1,"Luty",{"$f":"WEEKNUM(Tabela14[[#This Row],[Data]],2)","v":5},2018,"Luty"]
["2018-02-01","Zmiana A","33503F",775,552,1,"Luty",{"$f":"WEEKNUM(Tabela14[[#This Row],[Data]],2)","v":5},2018,"Luty"]
["2018-02-01","Zmiana B",1533713,325,107,1,"Luty",{"$f":"WEEKNUM(Tabela14[[#This Row],[Data]],2)","v":5},2018,"Luty"]
["2018-02-01","Zmiana B",192,57,5,1,"Luty",{"$f":"WEEKNUM(Tabela14[[#This Row],[Data]],2)","v":5},2018,"Luty"]
["2018-02-01","Zmiana B",198,454,500,1,"Luty",{"$f":"WEEKNUM(Tabela14[[#This Row],[Data]],2)","v":5},2018,"Luty"]
["2018-02-01","Zmiana B",269,81,90,1,"Luty",{"$f":"WEEKNUM(Tabela14[[#This Row],[Data]],2)","v":5},2018,"Luty"]
["2018-02-01","Zmiana B","33501F",214,232,1,"Luty",{"$f":"WEEKNUM(Tabela14[[#This Row],[Data]],2)","v":5},2018,"Luty"]
["2018-02-01","Zmiana B",119,643,400,1,"Luty",{"$f":"WEEKNUM(Tabela14[[#This Row],[Data]],2)","v":5},2018,"Luty"]
["2018-02-01","Zmiana B",358,72,78,1,"Luty",{"$f":"WEEKNUM(Tabela14[[#This Row],[Data]],2)","v":5},2018,"Luty"]
["2018-02-01","Zmiana B",894,303,341,1,"Luty",{"$f":"WEEKNUM(Tabela14[[#This Row],[Data]],2)","v":5},2018,"Luty"]
["2018-02-01","Zmiana C",498,2684,2399,1,"Luty",{"$f":"WEEKNUM(Tabela14[[#This Row],[Data]],2)","v":5},2018,"Luty"]
["2018-02-01","Zmiana C",1880156,261,236,1,"Luty",{"$f":"WEEKNUM(Tabela14[[#This Row],[Data]],2)","v":5},2018,"Luty"]
["2018-02-01","Zmiana C",570,631,600,1,"Luty",{"$f":"WEEKNUM(Tabela14[[#This Row],[Data]],2)","v":5},2018,"Luty"]
["2018-02-01","Zmiana C",212,60,20,1,"Luty",{"$f":"WEEKNUM(Tabela14[[#This Row],[Data]],2)","v":5},2018,"Luty"]
["2018-02-01","Zmiana C",546,258,10,1,"Luty",{"$f":"WEEKNUM(Tabela14[[#This Row],[Data]],2)","v":5},2018,"Luty"]
["2018-02-01","Zmiana C",761,301,173,1,"Luty",{"$f":"WEEKNUM(Tabela14[[#This Row],[Data]],2)","v":5},2018,"Luty"]
["2018-02-02","Zmiana A","33503F",496,363,2,"Luty",{"$f":"WEEKNUM(Tabela14[[#This Row],[Data]],2)","v":5},2018,"Luty"]
["2018-02-02","Zmiana A",643,91,2,2,"Luty",{"$f":"WEEKNUM(Tabela14[[#This Row],[Data]],2)","v":5},2018,"Luty"]
["2018-02-02","Zmiana A",2615043,119,8,2,"Luty",{"$f":"WEEKNUM(Tabela14[[#This Row],[Data]],2)","v":5},2018,"Luty"]
["2018-02-02","Zmiana A","717F",931,673,2,"Luty",{"$f":"WEEKNUM(Tabela14[[#This Row],[Data]],2)","v":5},2018,"Luty"]
["2018-02-02","Zmiana A",843,60,10,{"$f":"IF(A578=\"\",\"\",DAY(A578))","v":2},{"$f":"IFERROR(VLOOKUP(IF(A578=\"\",\"\",MONTH(A578)),$P$3:$Q$14,2,FALSE),\"\")","v":"Luty"},{"$f":"WEEKNUM(Tabela14[[#This Row],[Data]],2)","v":5},{"$f":"IF(A578=\"\",\"\",YEAR(A578))","v":2018},{"$f":"G578","v":"Luty"}]
["2018-02-02","Zmiana A",242,176,105,2,"Luty",{"$f":"WEEKNUM(Tabela14[[#This Row],[Data]],2)","v":5},2018,"Luty"]
["2018-02-02","Zmiana A",76,669,440,2,"Luty",{"$f":"WEEKNUM(Tabela14[[#This Row],[Data]],2)","v":5},2018,"Luty"]
["2018-02-02","Zmiana A",888,11,15,2,"Luty",{"$f":"WEEKNUM(Tabela14[[#This Row],[Data]],2)","v":5},2018,"Luty"]
["2018-02-02","Zmiana A",39,124,20,2,"Luty",{"$f":"WEEKNUM(Tabela14[[#This Row],[Data]],2)","v":5},2018,"Luty"]
["2018-02-02","Zmiana A",467,31,20,2,"Luty",{"$f":"WEEKNUM(Tabela14[[#This Row],[Data]],2)","v":5},2018,"Luty"]
["2018-02-02","Zmiana A",2126381,238,60,2,"Luty",{"$f":"WEEKNUM(Tabela14[[#This Row],[Data]],2)","v":5},2018,"Luty"]
["2018-02-02","Zmiana A",701,238,27,2,"Luty",{"$f":"WEEKNUM(Tabela14[[#This Row],[Data]],2)","v":5},2018,"Luty"]
["2018-02-02","Zmiana B",37,215,112,2,"Luty",{"$f":"WEEKNUM(Tabela14[[#This Row],[Data]],2)","v":5},2018,"Luty"]
["2018-02-02","Zmiana B",197,201,24,2,"Luty",{"$f":"WEEKNUM(Tabela14[[#This Row],[Data]],2)","v":5},2018,"Luty"]
["2018-02-02","Zmiana B",76,736,448,2,"Luty",{"$f":"WEEKNUM(Tabela14[[#This Row],[Data]],2)","v":5},2018,"Luty"]
["2018-02-02","Zmiana B",944,176,10,2,"Luty",{"$f":"WEEKNUM(Tabela14[[#This Row],[Data]],2)","v":5},2018,"Luty"]
["2018-02-02","Zmiana B",2310044,512,552,2,"Luty",{"$f":"WEEKNUM(Tabela14[[#This Row],[Data]],2)","v":5},2018,"Luty"]
["2018-02-02","Zmiana B",2296305,226,157,2,"Luty",{"$f":"WEEKNUM(Tabela14[[#This Row],[Data]],2)","v":5},2018,"Luty"]
["2018-02-02","Zmiana B",76,611,440,2,"Luty",{"$f":"WEEKNUM(Tabela14[[#This Row],[Data]],2)","v":5},2018,"Luty"]
["2018-02-02","Zmiana C",26144994,953,938,2,"Luty",{"$f":"WEEKNUM(Tabela14[[#This Row],[Data]],2)","v":5},2018,"Luty"]
["2018-02-02","Zmiana C",2510103,142,30,2,"Luty",{"$f":"WEEKNUM(Tabela14[[#This Row],[Data]],2)","v":5},2018,"Luty"]
["2018-02-02","Zmiana C",498,1632,1369,2,"Luty",{"$f":"WEEKNUM(Tabela14[[#This Row],[Data]],2)","v":5},2018,"Luty"]
["2018-02-02","Zmiana C",791,315,200,2,"Luty",{"$f":"WEEKNUM(Tabela14[[#This Row],[Data]],2)","v":5},2018,"Luty"]
["2018-02-05","Zmiana A","800-569638-F",278,64,5,"Luty",{"$f":"WEEKNUM(Tabela14[[#This Row],[Data]],2)","v":6},2018,"Luty"]
["2018-02-05","Zmiana A","33501F",229,240,5,"Luty",{"$f":"WEEKNUM(Tabela14[[#This Row],[Data]],2)","v":6},2018,"Luty"]
["2018-02-05","Zmiana A","33503F",223,250,5,"Luty",{"$f":"WEEKNUM(Tabela14[[#This Row],[Data]],2)","v":6},2018,"Luty"]
["2018-02-05","Zmiana A",415,279,10,5,"Luty",{"$f":"WEEKNUM(Tabela14[[#This Row],[Data]],2)","v":6},2018,"Luty"]
["2018-02-05","Zmiana A",2067417,181,10,5,"Luty",{"$f":"WEEKNUM(Tabela14[[#This Row],[Data]],2)","v":6},2018,"Luty"]
["2018-02-05","Zmiana A",307,170,20,5,"Luty",{"$f":"WEEKNUM(Tabela14[[#This Row],[Data]],2)","v":6},2018,"Luty"]
["2018-02-05","Zmiana A","716F",630,347,5,"Luty",{"$f":"WEEKNUM(Tabela14[[#This Row],[Data]],2)","v":6},2018,"Luty"]
["2018-02-05","Zmiana A","334F",273,13,5,"Luty",{"$f":"WEEKNUM(Tabela14[[#This Row],[Data]],2)","v":6},2018,"Luty"]
["2018-02-05","Zmiana A","719F",230,129,5,"Luty",{"$f":"WEEKNUM(Tabela14[[#This Row],[Data]],2)","v":6},2018,"Luty"]
["2018-02-05","Zmiana A",69,209,300,5,"Luty",{"$f":"WEEKNUM(Tabela14[[#This Row],[Data]],2)","v":6},2018,"Luty"]
["2018-02-05","Zmiana A",26144994,308,372,5,"Luty",{"$f":"WEEKNUM(Tabela14[[#This Row],[Data]],2)","v":6},2018,"Luty"]
["2018-02-05","Zmiana A",498,2108,2035,5,"Luty",{"$f":"WEEKNUM(Tabela14[[#This Row],[Data]],2)","v":6},2018,"Luty"]
["2018-02-05","Zmiana B",101,427,218,5,"Luty",{"$f":"WEEKNUM(Tabela14[[#This Row],[Data]],2)","v":6},2018,"Luty"]
["2018-02-05","Zmiana B",198,636,400,5,"Luty",{"$f":"WEEKNUM(Tabela14[[#This Row],[Data]],2)","v":6},2018,"Luty"]
["2018-02-05","Zmiana B",571,741,444,5,"Luty",{"$f":"WEEKNUM(Tabela14[[#This Row],[Data]],2)","v":6},2018,"Luty"]
["2018-02-05","Zmiana B",2451635,256,300,5,"Luty",{"$f":"WEEKNUM(Tabela14[[#This Row],[Data]],2)","v":6},2018,"Luty"]
["2018-02-06","Zmiana C",498,2548,2396,6,"Luty",{"$f":"WEEKNUM(Tabela14[[#This Row],[Data]],2)","v":6},2018,"Luty"]
["2018-02-06","Zmiana A",482,107,157,6,"Luty",{"$f":"WEEKNUM(Tabela14[[#This Row],[Data]],2)","v":6},2018,"Luty"]
["2018-02-06","Zmiana A","713F",256,306,6,"Luty",{"$f":"WEEKNUM(Tabela14[[#This Row],[Data]],2)","v":6},2018,"Luty"]
["2018-02-06","Zmiana A","300F",362,412,6,"Luty",{"$f":"WEEKNUM(Tabela14[[#This Row],[Data]],2)","v":6},2018,"Luty"]
["2018-02-06","Zmiana A",812,406,456,6,"Luty",{"$f":"WEEKNUM(Tabela14[[#This Row],[Data]],2)","v":6},2018,"Luty"]
["2018-02-06","Zmiana A",575,208,258,6,"Luty",{"$f":"WEEKNUM(Tabela14[[#This Row],[Data]],2)","v":6},2018,"Luty"]
["2018-02-06","Zmiana A",617,139,189,6,"Luty",{"$f":"WEEKNUM(Tabela14[[#This Row],[Data]],2)","v":6},2018,"Luty"]
["2018-02-06","Zmiana A","721F",290,340,6,"Luty",{"$f":"WEEKNUM(Tabela14[[#This Row],[Data]],2)","v":6},2018,"Luty"]
["2018-02-06","Zmiana A",2007977,21,71,6,"Luty",{"$f":"WEEKNUM(Tabela14[[#This Row],[Data]],2)","v":6},2018,"Luty"]
["2018-02-06","Zmiana A",2113026,179,229,6,"Luty",{"$f":"WEEKNUM(Tabela14[[#This Row],[Data]],2)","v":6},2018,"Luty"]
["2018-02-06","Zmiana A",593,172,222,6,"Luty",{"$f":"WEEKNUM(Tabela14[[#This Row],[Data]],2)","v":6},2018,"Luty"]
["2018-02-06","Zmiana A",437,530,580,6,"Luty",{"$f":"WEEKNUM(Tabela14[[#This Row],[Data]],2)","v":6},2018,"Luty"]
["2018-02-06","Zmiana A",498,1851,1901,6,"Luty",{"$f":"WEEKNUM(Tabela14[[#This Row],[Data]],2)","v":6},2018,"Luty"]
["2018-02-06","Zmiana A",560,637,687,6,"Luty",{"$f":"WEEKNUM(Tabela14[[#This Row],[Data]],2)","v":6},2018,"Luty"]
["2018-02-06","Zmiana A",787,368,418,6,"Luty",{"$f":"WEEKNUM(Tabela14[[#This Row],[Data]],2)","v":6},2018,"Luty"]
["2018-02-06","Zmiana B",844,293,343,6,"Luty",{"$f":"WEEKNUM(Tabela14[[#This Row],[Data]],2)","v":6},2018,"Luty"]
["2018-02-06","Zmiana B",958,256,306,6,"Luty",{"$f":"WEEKNUM(Tabela14[[#This Row],[Data]],2)","v":6},2018,"Luty"]
["2018-02-06","Zmiana B",160,316,366,6,"Luty",{"$f":"WEEKNUM(Tabela14[[#This Row],[Data]],2)","v":6},2018,"Luty"]
["2018-02-06","Zmiana B",1901726,502,552,6,"Luty",{"$f":"WEEKNUM(Tabela14[[#This Row],[Data]],2)","v":6},2018,"Luty"]
["2018-02-06","Zmiana B",2296305,475,525,6,"Luty",{"$f":"WEEKNUM(Tabela14[[#This Row],[Data]],2)","v":6},2018,"Luty"]
["2018-02-06","Zmiana C",326,2511,2561,6,"Luty",{"$f":"WEEKNUM(Tabela14[[#This Row],[Data]],2)","v":6},2018,"Luty"]
["2018-02-07","Zmiana A","33501F",39,89,7,"Luty",{"$f":"WEEKNUM(Tabela14[[#This Row],[Data]],2)","v":6},2018,"Luty"]
["2018-02-07","Zmiana A","300F",158,208,7,"Luty",{"$f":"WEEKNUM(Tabela14[[#This Row],[Data]],2)","v":6},2018,"Luty"]
["2018-02-07","Zmiana A",2432300,1241,1291,7,"Luty",{"$f":"WEEKNUM(Tabela14[[#This Row],[Data]],2)","v":6},2018,"Luty"]
["2018-02-07","Zmiana A",326,3210,3260,7,"Luty",{"$f":"WEEKNUM(Tabela14[[#This Row],[Data]],2)","v":6},2018,"Luty"]
["2018-02-07","Zmiana A",839,460,510,7,"Luty",{"$f":"WEEKNUM(Tabela14[[#This Row],[Data]],2)","v":6},2018,"Luty"]
["2018-02-07","Zmiana A",933,514,564,7,"Luty",{"$f":"WEEKNUM(Tabela14[[#This Row],[Data]],2)","v":6},2018,"Luty"]
["2018-02-07","Zmiana A",431,277,327,7,"Luty",{"$f":"WEEKNUM(Tabela14[[#This Row],[Data]],2)","v":6},2018,"Luty"]
["2018-02-07","Zmiana A",701,25,75,7,"Luty",{"$f":"WEEKNUM(Tabela14[[#This Row],[Data]],2)","v":6},2018,"Luty"]
["2018-02-07","Zmiana B",41,275,325,{"$f":"IF(A642=\"\",\"\",DAY(A642))","v":7},{"$f":"IFERROR(VLOOKUP(IF(A642=\"\",\"\",MONTH(A642)),$P$3:$Q$14,2,FALSE),\"\")","v":"Luty"},{"$f":"WEEKNUM(Tabela14[[#This Row],[Data]],2)","v":6},{"$f":"IF(A642=\"\",\"\",YEAR(A642))","v":2018},{"$f":"G642","v":"Luty"}]
["2018-02-07","Zmiana B",2237976,385,435,7,"Luty",{"$f":"WEEKNUM(Tabela14[[#This Row],[Data]],2)","v":6},2018,"Luty"]
["2018-02-07","Zmiana B",966,280,330,7,"Luty",{"$f":"WEEKNUM(Tabela14[[#This Row],[Data]],2)","v":6},2018,"Luty"]
["2018-02-07","Zmiana B",845,145,195,7,"Luty",{"$f":"WEEKNUM(Tabela14[[#This Row],[Data]],2)","v":6},2018,"Luty"]
["2018-02-07","Zmiana B",22,389,439,7,"Luty",{"$f":"WEEKNUM(Tabela14[[#This Row],[Data]],2)","v":6},2018,"Luty"]
["2018-02-07","Zmiana B",2408708,382,432,7,"Luty",{"$f":"WEEKNUM(Tabela14[[#This Row],[Data]],2)","v":6},2018,"Luty"]
["2018-02-07","Zmiana B",2007977,57,107,7,"Luty",{"$f":"WEEKNUM(Tabela14[[#This Row],[Data]],2)","v":6},2018,"Luty"]
["2018-02-07","Zmiana C",498,2429,2479,7,"Luty",{"$f":"WEEKNUM(Tabela14[[#This Row],[Data]],2)","v":6},2018,"Luty"]
["2018-02-08","Zmiana A",2030723,839,889,8,"Luty",{"$f":"WEEKNUM(Tabela14[[#This Row],[Data]],2)","v":6},2018,"Luty"]
["2018-02-08","Zmiana A","717f",309,359,8,"Luty",{"$f":"WEEKNUM(Tabela14[[#This Row],[Data]],2)","v":6},2018,"Luty"]
["2018-02-08","Zmiana A",514,139,189,8,"Luty",{"$f":"WEEKNUM(Tabela14[[#This Row],[Data]],2)","v":6},2018,"Luty"]
["2018-02-08","Zmiana A",179,916,966,8,"Luty",{"$f":"WEEKNUM(Tabela14[[#This Row],[Data]],2)","v":6},2018,"Luty"]
["2018-02-08","Zmiana A",787,413,463,8,"Luty",{"$f":"WEEKNUM(Tabela14[[#This Row],[Data]],2)","v":6},2018,"Luty"]
["2018-02-08","Zmiana A",554,213,263,8,"Luty",{"$f":"WEEKNUM(Tabela14[[#This Row],[Data]],2)","v":6},2018,"Luty"]
["2018-02-08","Zmiana A",888,38,88,8,"Luty",{"$f":"WEEKNUM(Tabela14[[#This Row],[Data]],2)","v":6},2018,"Luty"]
["2018-02-08","Zmiana A",341,160,210,8,"Luty",{"$f":"WEEKNUM(Tabela14[[#This Row],[Data]],2)","v":6},2018,"Luty"]
["2018-02-08","Zmiana A",2035613,179,229,8,"Luty",{"$f":"WEEKNUM(Tabela14[[#This Row],[Data]],2)","v":6},2018,"Luty"]
["2018-02-08","Zmiana A",498,2497,2547,8,"Luty",{"$f":"WEEKNUM(Tabela14[[#This Row],[Data]],2)","v":6},2018,"Luty"]
["2018-02-08","Zmiana A",812,1208,1258,8,"Luty",{"$f":"WEEKNUM(Tabela14[[#This Row],[Data]],2)","v":6},2018,"Luty"]
["2018-02-08","Zmiana A",634,260,310,8,"Luty",{"$f":"WEEKNUM(Tabela14[[#This Row],[Data]],2)","v":6},2018,"Luty"]
["2018-02-08","Zmiana A",119,670,720,8,"Luty",{"$f":"WEEKNUM(Tabela14[[#This Row],[Data]],2)","v":6},2018,"Luty"]
["2018-02-08","Zmiana B",896,115,165,8,"Luty",{"$f":"WEEKNUM(Tabela14[[#This Row],[Data]],2)","v":6},2018,"Luty"]
["2018-02-08","Zmiana B",554,86,136,8,"Luty",{"$f":"WEEKNUM(Tabela14[[#This Row],[Data]],2)","v":6},2018,"Luty"]
["2018-02-08","Zmiana B",2494417,326,376,8,"Luty",{"$f":"WEEKNUM(Tabela14[[#This Row],[Data]],2)","v":6},2018,"Luty"]
["2018-02-08","Zmiana B",776,0,50,8,"Luty",{"$f":"WEEKNUM(Tabela14[[#This Row],[Data]],2)","v":6},2018,"Luty"]
["2018-02-08","Zmiana B",738,258,308,8,"Luty",{"$f":"WEEKNUM(Tabela14[[#This Row],[Data]],2)","v":6},2018,"Luty"]
["2018-02-08","Zmiana B",2451635,153,203,8,"Luty",{"$f":"WEEKNUM(Tabela14[[#This Row],[Data]],2)","v":6},2018,"Luty"]
["2018-02-08","Zmiana B",252,552,602,8,"Luty",{"$f":"WEEKNUM(Tabela14[[#This Row],[Data]],2)","v":6},2018,"Luty"]
["2018-02-08","Zmiana C",498,2539,2589,8,"Luty",{"$f":"WEEKNUM(Tabela14[[#This Row],[Data]],2)","v":6},2018,"Luty"]
["2018-02-09","Zmiana A",677,249,299,9,"Luty",{"$f":"WEEKNUM(Tabela14[[#This Row],[Data]],2)","v":6},2018,"Luty"]
["2018-02-09","Zmiana A","722F",84,134,9,"Luty",{"$f":"WEEKNUM(Tabela14[[#This Row],[Data]],2)","v":6},2018,"Luty"]
["2018-02-09","Zmiana A","721F",462,512,9,"Luty",{"$f":"WEEKNUM(Tabela14[[#This Row],[Data]],2)","v":6},2018,"Luty"]
["2018-02-09","Zmiana A","708F",97,147,9,"Luty",{"$f":"WEEKNUM(Tabela14[[#This Row],[Data]],2)","v":6},2018,"Luty"]
["2018-02-09","Zmiana A",2451635,382,432,9,"Luty",{"$f":"WEEKNUM(Tabela14[[#This Row],[Data]],2)","v":6},2018,"Luty"]
["2018-02-09","Zmiana A",570,590,640,9,"Luty",{"$f":"WEEKNUM(Tabela14[[#This Row],[Data]],2)","v":6},2018,"Luty"]
["2018-02-09","Zmiana A",543,332,382,9,"Luty",{"$f":"WEEKNUM(Tabela14[[#This Row],[Data]],2)","v":6},2018,"Luty"]
["2018-02-09","Zmiana A",162,250,300,9,"Luty",{"$f":"WEEKNUM(Tabela14[[#This Row],[Data]],2)","v":6},2018,"Luty"]
["2018-02-09","Zmiana A",416,119,169,9,"Luty",{"$f":"WEEKNUM(Tabela14[[#This Row],[Data]],2)","v":6},2018,"Luty"]
["2018-02-09","Zmiana A",31,409,459,9,"Luty",{"$f":"WEEKNUM(Tabela14[[#This Row],[Data]],2)","v":6},2018,"Luty"]
["2018-02-09","Zmiana A",2001723,12,62,9,"Luty",{"$f":"WEEKNUM(Tabela14[[#This Row],[Data]],2)","v":6},2018,"Luty"]
["2018-02-09","Zmiana A",498,2655,2705,9,"Luty",{"$f":"WEEKNUM(Tabela14[[#This Row],[Data]],2)","v":6},2018,"Luty"]
["2018-02-09","Zmiana A","334F",967,1017,9,"Luty",{"$f":"WEEKNUM(Tabela14[[#This Row],[Data]],2)","v":6},2018,"Luty"]
["2018-02-09","Zmiana A",162,351,401,9,"Luty",{"$f":"WEEKNUM(Tabela14[[#This Row],[Data]],2)","v":6},2018,"Luty"]
["2018-02-09","Zmiana B",894,284,334,9,"Luty",{"$f":"WEEKNUM(Tabela14[[#This Row],[Data]],2)","v":6},2018,"Luty"]
["2018-02-09","Zmiana B",1901726,76,126,9,"Luty",{"$f":"WEEKNUM(Tabela14[[#This Row],[Data]],2)","v":6},2018,"Luty"]
["2018-02-09","Zmiana B",701,6,56,9,"Luty",{"$f":"WEEKNUM(Tabela14[[#This Row],[Data]],2)","v":6},2018,"Luty"]
["2018-02-09","Zmiana B",2310044,507,557,9,"Luty",{"$f":"WEEKNUM(Tabela14[[#This Row],[Data]],2)","v":6},2018,"Luty"]
["2018-02-09","Zmiana B",119,375,425,9,"Luty",{"$f":"WEEKNUM(Tabela14[[#This Row],[Data]],2)","v":6},2018,"Luty"]
["2018-02-09","Zmiana C",498,1804,1854,9,"Luty",{"$f":"WEEKNUM(Tabela14[[#This Row],[Data]],2)","v":6},2018,"Luty"]
["2018-02-09","Zmiana C",326,772,822,9,"Luty",{"$f":"WEEKNUM(Tabela14[[#This Row],[Data]],2)","v":6},2018,"Luty"]
["2018-02-10","Zmiana A",701,14,64,10,"Luty",{"$f":"WEEKNUM(Tabela14[[#This Row],[Data]],2)","v":6},2018,"Luty"]
["2018-02-10","Zmiana A",513,135,185,10,"Luty",{"$f":"WEEKNUM(Tabela14[[#This Row],[Data]],2)","v":6},2018,"Luty"]
["2018-02-10","Zmiana A",797,114,164,10,"Luty",{"$f":"WEEKNUM(Tabela14[[#This Row],[Data]],2)","v":6},2018,"Luty"]
["2018-02-10","Zmiana A",817,97,147,10,"Luty",{"$f":"WEEKNUM(Tabela14[[#This Row],[Data]],2)","v":6},2018,"Luty"]
["2018-02-10","Zmiana A",310,72,122,10,"Luty",{"$f":"WEEKNUM(Tabela14[[#This Row],[Data]],2)","v":6},2018,"Luty"]
["2018-02-10","Zmiana A",812,820,870,10,"Luty",{"$f":"WEEKNUM(Tabela14[[#This Row],[Data]],2)","v":6},2018,"Luty"]
["2018-02-10","Zmiana A",326,2802,2852,10,"Luty",{"$f":"WEEKNUM(Tabela14[[#This Row],[Data]],2)","v":6},2018,"Luty"]
["2018-02-12","Zmiana A",812,258,308,12,"Luty",{"$f":"WEEKNUM(Tabela14[[#This Row],[Data]],2)","v":7},2018,"Luty"]
["2018-02-12","Zmiana A",2297015,239,289,12,"Luty",{"$f":"WEEKNUM(Tabela14[[#This Row],[Data]],2)","v":7},2018,"Luty"]
["2018-02-12","Zmiana A",307,8,58,12,"Luty",{"$f":"WEEKNUM(Tabela14[[#This Row],[Data]],2)","v":7},2018,"Luty"]
["2018-02-12","Zmiana A",562,22,72,12,"Luty",{"$f":"WEEKNUM(Tabela14[[#This Row],[Data]],2)","v":7},2018,"Luty"]
["2018-02-12","Zmiana A",468,201,251,12,"Luty",{"$f":"WEEKNUM(Tabela14[[#This Row],[Data]],2)","v":7},2018,"Luty"]
["2018-02-12","Zmiana A",482,82,132,12,"Luty",{"$f":"WEEKNUM(Tabela14[[#This Row],[Data]],2)","v":7},2018,"Luty"]
["2018-02-12","Zmiana A",958,301,351,12,"Luty",{"$f":"WEEKNUM(Tabela14[[#This Row],[Data]],2)","v":7},2018,"Luty"]
["2018-02-12","Zmiana A",917,36,86,{"$f":"IF(A706=\"\",\"\",DAY(A706))","v":12},{"$f":"IFERROR(VLOOKUP(IF(A706=\"\",\"\",MONTH(A706)),$P$3:$Q$14,2,FALSE),\"\")","v":"Luty"},{"$f":"WEEKNUM(Tabela14[[#This Row],[Data]],2)","v":7},{"$f":"IF(A706=\"\",\"\",YEAR(A706))","v":2018},{"$f":"G706","v":"Luty"}]
["2018-02-12","Zmiana A",872,251,301,12,"Luty",{"$f":"WEEKNUM(Tabela14[[#This Row],[Data]],2)","v":7},2018,"Luty"]
["2018-02-12","Zmiana A",415,292,342,12,"Luty",{"$f":"WEEKNUM(Tabela14[[#This Row],[Data]],2)","v":7},2018,"Luty"]
["2018-02-12","Zmiana A",1919305,279,329,12,"Luty",{"$f":"WEEKNUM(Tabela14[[#This Row],[Data]],2)","v":7},2018,"Luty"]
["2018-02-12","Zmiana A",593,205,255,12,"Luty",{"$f":"WEEKNUM(Tabela14[[#This Row],[Data]],2)","v":7},2018,"Luty"]
["2018-02-12","Zmiana A",2149709,115,165,12,"Luty",{"$f":"WEEKNUM(Tabela14[[#This Row],[Data]],2)","v":7},2018,"Luty"]
["2018-02-12","Zmiana A",498,1458,1508,12,"Luty",{"$f":"WEEKNUM(Tabela14[[#This Row],[Data]],2)","v":7},2018,"Luty"]
["2018-02-12","Zmiana A",326,2003,2053,12,"Luty",{"$f":"WEEKNUM(Tabela14[[#This Row],[Data]],2)","v":7},2018,"Luty"]
["2018-02-12","Zmiana A",634,675,725,12,"Luty",{"$f":"WEEKNUM(Tabela14[[#This Row],[Data]],2)","v":7},2018,"Luty"]
["2018-02-12","Zmiana A","334F",1093,1143,12,"Luty",{"$f":"WEEKNUM(Tabela14[[#This Row],[Data]],2)","v":7},2018,"Luty"]
["2018-02-12","Zmiana B",198,360,410,12,"Luty",{"$f":"WEEKNUM(Tabela14[[#This Row],[Data]],2)","v":7},2018,"Luty"]
["2018-02-12","Zmiana B",746,38,88,12,"Luty",{"$f":"WEEKNUM(Tabela14[[#This Row],[Data]],2)","v":7},2018,"Luty"]
["2018-02-12","Zmiana B",693,3314,3364,12,"Luty",{"$f":"WEEKNUM(Tabela14[[#This Row],[Data]],2)","v":7},2018,"Luty"]
["2018-02-12","Zmiana B",2297015,634,684,12,"Luty",{"$f":"WEEKNUM(Tabela14[[#This Row],[Data]],2)","v":7},2018,"Luty"]
["2018-02-12","Zmiana B",791,75,125,12,"Luty",{"$f":"WEEKNUM(Tabela14[[#This Row],[Data]],2)","v":7},2018,"Luty"]
["2018-02-12","Zmiana B",693,1186,1236,12,"Luty",{"$f":"WEEKNUM(Tabela14[[#This Row],[Data]],2)","v":7},2018,"Luty"]
["2018-02-12","Zmiana C",326,2660,2710,12,"Luty",{"$f":"WEEKNUM(Tabela14[[#This Row],[Data]],2)","v":7},2018,"Luty"]
["2018-02-13","Zmiana A",2494417,130,180,13,"Luty",{"$f":"WEEKNUM(Tabela14[[#This Row],[Data]],2)","v":7},2018,"Luty"]
["2018-02-13","Zmiana A",437,124,174,13,"Luty",{"$f":"WEEKNUM(Tabela14[[#This Row],[Data]],2)","v":7},2018,"Luty"]
["2018-02-13","Zmiana A",416,141,191,13,"Luty",{"$f":"WEEKNUM(Tabela14[[#This Row],[Data]],2)","v":7},2018,"Luty"]
["2018-02-13","Zmiana A","716F",701,751,13,"Luty",{"$f":"WEEKNUM(Tabela14[[#This Row],[Data]],2)","v":7},2018,"Luty"]
["2018-02-13","Zmiana A",634,499,549,13,"Luty",{"$f":"WEEKNUM(Tabela14[[#This Row],[Data]],2)","v":7},2018,"Luty"]
["2018-02-13","Zmiana A",894,186,236,13,"Luty",{"$f":"WEEKNUM(Tabela14[[#This Row],[Data]],2)","v":7},2018,"Luty"]
["2018-02-13","Zmiana A",2296305,796,846,13,"Luty",{"$f":"WEEKNUM(Tabela14[[#This Row],[Data]],2)","v":7},2018,"Luty"]
["2018-02-13","Zmiana A",326,3118,3168,13,"Luty",{"$f":"WEEKNUM(Tabela14[[#This Row],[Data]],2)","v":7},2018,"Luty"]
["2018-02-13","Zmiana A",593,80,130,13,"Luty",{"$f":"WEEKNUM(Tabela14[[#This Row],[Data]],2)","v":7},2018,"Luty"]
["2018-02-13","Zmiana A",1533713,445,495,13,"Luty",{"$f":"WEEKNUM(Tabela14[[#This Row],[Data]],2)","v":7},2018,"Luty"]
["2018-02-13","Zmiana A","717F",785,835,13,"Luty",{"$f":"WEEKNUM(Tabela14[[#This Row],[Data]],2)","v":7},2018,"Luty"]
["2018-02-13","Zmiana B",772,229,279,13,"Luty",{"$f":"WEEKNUM(Tabela14[[#This Row],[Data]],2)","v":7},2018,"Luty"]
["2018-02-13","Zmiana B",617,96,146,13,"Luty",{"$f":"WEEKNUM(Tabela14[[#This Row],[Data]],2)","v":7},2018,"Luty"]
["2018-02-13","Zmiana B",839,199,249,13,"Luty",{"$f":"WEEKNUM(Tabela14[[#This Row],[Data]],2)","v":7},2018,"Luty"]
["2018-02-13","Zmiana B",2035613,377,427,13,"Luty",{"$f":"WEEKNUM(Tabela14[[#This Row],[Data]],2)","v":7},2018,"Luty"]
["2018-02-13","Zmiana B",2451635,709,759,13,"Luty",{"$f":"WEEKNUM(Tabela14[[#This Row],[Data]],2)","v":7},2018,"Luty"]
["2018-02-13","Zmiana B",575,238,288,13,"Luty",{"$f":"WEEKNUM(Tabela14[[#This Row],[Data]],2)","v":7},2018,"Luty"]
["2018-02-13","Zmiana B",772,39,89,13,"Luty",{"$f":"WEEKNUM(Tabela14[[#This Row],[Data]],2)","v":7},2018,"Luty"]
["2018-02-13","Zmiana B",617,4,54,13,"Luty",{"$f":"WEEKNUM(Tabela14[[#This Row],[Data]],2)","v":7},2018,"Luty"]
["2018-02-13","Zmiana B",839,368,418,13,"Luty",{"$f":"WEEKNUM(Tabela14[[#This Row],[Data]],2)","v":7},2018,"Luty"]
["2018-02-13","Zmiana B",2035613,442,492,13,"Luty",{"$f":"WEEKNUM(Tabela14[[#This Row],[Data]],2)","v":7},2018,"Luty"]
["2018-02-13","Zmiana B",2451635,616,666,13,"Luty",{"$f":"WEEKNUM(Tabela14[[#This Row],[Data]],2)","v":7},2018,"Luty"]
["2018-02-13","Zmiana B",575,361,411,13,"Luty",{"$f":"WEEKNUM(Tabela14[[#This Row],[Data]],2)","v":7},2018,"Luty"]
["2018-02-13","Zmiana C",498,2172,2222,13,"Luty",{"$f":"WEEKNUM(Tabela14[[#This Row],[Data]],2)","v":7},2018,"Luty"]
["2018-02-13","Zmiana C",326,306,356,13,"Luty",{"$f":"WEEKNUM(Tabela14[[#This Row],[Data]],2)","v":7},2018,"Luty"]
["2018-02-14","Zmiana A","33501F",728,778,14,"Luty",{"$f":"WEEKNUM(Tabela14[[#This Row],[Data]],2)","v":7},2018,"Luty"]
["2018-02-14","Zmiana A",418,80,130,14,"Luty",{"$f":"WEEKNUM(Tabela14[[#This Row],[Data]],2)","v":7},2018,"Luty"]
["2018-02-14","Zmiana A","334F",1093,1143,14,"Luty",{"$f":"WEEKNUM(Tabela14[[#This Row],[Data]],2)","v":7},2018,"Luty"]
["2018-02-14","Zmiana A",48,56,106,14,"Luty",{"$f":"WEEKNUM(Tabela14[[#This Row],[Data]],2)","v":7},2018,"Luty"]
["2018-02-14","Zmiana A","802F",108,158,14,"Luty",{"$f":"WEEKNUM(Tabela14[[#This Row],[Data]],2)","v":7},2018,"Luty"]
["2018-02-14","Zmiana A",479,65,115,14,"Luty",{"$f":"WEEKNUM(Tabela14[[#This Row],[Data]],2)","v":7},2018,"Luty"]
["2018-02-14","Zmiana A",326,3543,3593,14,"Luty",{"$f":"WEEKNUM(Tabela14[[#This Row],[Data]],2)","v":7},2018,"Luty"]
["2018-02-14","Zmiana A",498,236,286,14,"Luty",{"$f":"WEEKNUM(Tabela14[[#This Row],[Data]],2)","v":7},2018,"Luty"]
["2018-02-14","Zmiana A",437,656,706,14,"Luty",{"$f":"WEEKNUM(Tabela14[[#This Row],[Data]],2)","v":7},2018,"Luty"]
["2018-02-14","Zmiana A",2310044,720,770,14,"Luty",{"$f":"WEEKNUM(Tabela14[[#This Row],[Data]],2)","v":7},2018,"Luty"]
["2018-02-14","Zmiana B",844,196,246,14,"Luty",{"$f":"WEEKNUM(Tabela14[[#This Row],[Data]],2)","v":7},2018,"Luty"]
["2018-02-14","Zmiana B",119,645,695,14,"Luty",{"$f":"WEEKNUM(Tabela14[[#This Row],[Data]],2)","v":7},2018,"Luty"]
["2018-02-14","Zmiana B",2451636,304,354,14,"Luty",{"$f":"WEEKNUM(Tabela14[[#This Row],[Data]],2)","v":7},2018,"Luty"]
["2018-02-14","Zmiana C",498,1175,1225,14,"Luty",{"$f":"WEEKNUM(Tabela14[[#This Row],[Data]],2)","v":7},2018,"Luty"]
["2018-02-14","Zmiana C",160,229,279,14,"Luty",{"$f":"WEEKNUM(Tabela14[[#This Row],[Data]],2)","v":7},2018,"Luty"]
["2018-02-14","Zmiana C",1901726,461,511,14,"Luty",{"$f":"WEEKNUM(Tabela14[[#This Row],[Data]],2)","v":7},2018,"Luty"]
["2018-02-14","Zmiana C",310,21,71,14,"Luty",{"$f":"WEEKNUM(Tabela14[[#This Row],[Data]],2)","v":7},2018,"Luty"]
["2018-02-14","Zmiana C",2001994,280,330,14,"Luty",{"$f":"WEEKNUM(Tabela14[[#This Row],[Data]],2)","v":7},2018,"Luty"]
["2018-02-15","Zmiana A",787,297,347,15,"Luty",{"$f":"WEEKNUM(Tabela14[[#This Row],[Data]],2)","v":7},2018,"Luty"]
["2018-02-15","Zmiana A",894,166,216,15,"Luty",{"$f":"WEEKNUM(Tabela14[[#This Row],[Data]],2)","v":7},2018,"Luty"]
["2018-02-15","Zmiana A",812,241,291,15,"Luty",{"$f":"WEEKNUM(Tabela14[[#This Row],[Data]],2)","v":7},2018,"Luty"]
["2018-02-15","Zmiana A","717F",529,579,15,"Luty",{"$f":"WEEKNUM(Tabela14[[#This Row],[Data]],2)","v":7},2018,"Luty"]
["2018-02-15","Zmiana A","33503F",44,94,{"$f":"IF(A770=\"\",\"\",DAY(A770))","v":15},{"$f":"IFERROR(VLOOKUP(IF(A770=\"\",\"\",MONTH(A770)),$P$3:$Q$14,2,FALSE),\"\")","v":"Luty"},{"$f":"WEEKNUM(Tabela14[[#This Row],[Data]],2)","v":7},{"$f":"IF(A770=\"\",\"\",YEAR(A770))","v":2018},{"$f":"G770","v":"Luty"}]
["2018-02-15","Zmiana A",1879620,23,73,15,"Luty",{"$f":"WEEKNUM(Tabela14[[#This Row],[Data]],2)","v":7},2018,"Luty"]
["2018-02-15","Zmiana A",2408708,399,449,15,"Luty",{"$f":"WEEKNUM(Tabela14[[#This Row],[Data]],2)","v":7},2018,"Luty"]
["2018-02-15","Zmiana A",498,2048,2098,15,"Luty",{"$f":"WEEKNUM(Tabela14[[#This Row],[Data]],2)","v":7},2018,"Luty"]
["2018-02-15","Zmiana A",326,209,259,15,"Luty",{"$f":"WEEKNUM(Tabela14[[#This Row],[Data]],2)","v":7},2018,"Luty"]
["2018-02-15","Zmiana A",119,254,304,15,"Luty",{"$f":"WEEKNUM(Tabela14[[#This Row],[Data]],2)","v":7},2018,"Luty"]
["2018-02-15","Zmiana A",933,655,705,15,"Luty",{"$f":"WEEKNUM(Tabela14[[#This Row],[Data]],2)","v":7},2018,"Luty"]
["2018-02-15","Zmiana B",746,104,154,15,"Luty",{"$f":"WEEKNUM(Tabela14[[#This Row],[Data]],2)","v":7},2018,"Luty"]
["2018-02-15","Zmiana B",166,296,346,15,"Luty",{"$f":"WEEKNUM(Tabela14[[#This Row],[Data]],2)","v":7},2018,"Luty"]
["2018-02-15","Zmiana B",495,143,193,15,"Luty",{"$f":"WEEKNUM(Tabela14[[#This Row],[Data]],2)","v":7},2018,"Luty"]
["2018-02-15","Zmiana B",2408709,336,386,15,"Luty",{"$f":"WEEKNUM(Tabela14[[#This Row],[Data]],2)","v":7},2018,"Luty"]
["2018-02-15","Zmiana B",160,284,334,15,"Luty",{"$f":"WEEKNUM(Tabela14[[#This Row],[Data]],2)","v":7},2018,"Luty"]
["2018-02-15","Zmiana B",202,147,197,15,"Luty",{"$f":"WEEKNUM(Tabela14[[#This Row],[Data]],2)","v":7},2018,"Luty"]
["2018-02-15","Zmiana B",119,711,761,15,"Luty",{"$f":"WEEKNUM(Tabela14[[#This Row],[Data]],2)","v":7},2018,"Luty"]
["2018-02-15","Zmiana B",791,323,373,15,"Luty",{"$f":"WEEKNUM(Tabela14[[#This Row],[Data]],2)","v":7},2018,"Luty"]
["2018-02-16","Zmiana A","346F",485,535,16,"Luty",{"$f":"WEEKNUM(Tabela14[[#This Row],[Data]],2)","v":7},2018,"Luty"]
["2018-02-16","Zmiana A",2334641,519,569,16,"Luty",{"$f":"WEEKNUM(Tabela14[[#This Row],[Data]],2)","v":7},2018,"Luty"]
["2018-02-16","Zmiana A",996,632,682,16,"Luty",{"$f":"WEEKNUM(Tabela14[[#This Row],[Data]],2)","v":7},2018,"Luty"]
["2018-02-16","Zmiana A",871,208,258,16,"Luty",{"$f":"WEEKNUM(Tabela14[[#This Row],[Data]],2)","v":7},2018,"Luty"]
["2018-02-16","Zmiana A",593,181,231,16,"Luty",{"$f":"WEEKNUM(Tabela14[[#This Row],[Data]],2)","v":7},2018,"Luty"]
["2018-02-16","Zmiana A",319,121,171,16,"Luty",{"$f":"WEEKNUM(Tabela14[[#This Row],[Data]],2)","v":7},2018,"Luty"]
["2018-02-16","Zmiana A",1901726,224,274,16,"Luty",{"$f":"WEEKNUM(Tabela14[[#This Row],[Data]],2)","v":7},2018,"Luty"]
["2018-02-16","Zmiana A",498,2914,2964,16,"Luty",{"$f":"WEEKNUM(Tabela14[[#This Row],[Data]],2)","v":7},2018,"Luty"]
["2018-02-16","Zmiana A",356,143,193,16,"Luty",{"$f":"WEEKNUM(Tabela14[[#This Row],[Data]],2)","v":7},2018,"Luty"]
["2018-02-16","Zmiana A",2297015,212,262,16,"Luty",{"$f":"WEEKNUM(Tabela14[[#This Row],[Data]],2)","v":7},2018,"Luty"]
["2018-02-16","Zmiana A",69,341,391,16,"Luty",{"$f":"WEEKNUM(Tabela14[[#This Row],[Data]],2)","v":7},2018,"Luty"]
["2018-02-16","Zmiana A",701,283,333,16,"Luty",{"$f":"WEEKNUM(Tabela14[[#This Row],[Data]],2)","v":7},2018,"Luty"]
["2018-02-16","Zmiana B",358,224,274,16,"Luty",{"$f":"WEEKNUM(Tabela14[[#This Row],[Data]],2)","v":7},2018,"Luty"]
["2018-02-16","Zmiana B",702,213,263,16,"Luty",{"$f":"WEEKNUM(Tabela14[[#This Row],[Data]],2)","v":7},2018,"Luty"]
["2018-02-16","Zmiana B","300F",9,59,16,"Luty",{"$f":"WEEKNUM(Tabela14[[#This Row],[Data]],2)","v":7},2018,"Luty"]
["2018-02-16","Zmiana B","33505F",2,52,16,"Luty",{"$f":"WEEKNUM(Tabela14[[#This Row],[Data]],2)","v":7},2018,"Luty"]
["2018-02-16","Zmiana B",2418977,264,314,16,"Luty",{"$f":"WEEKNUM(Tabela14[[#This Row],[Data]],2)","v":7},2018,"Luty"]
["2018-02-16","Zmiana B","S122309",743,793,16,"Luty",{"$f":"WEEKNUM(Tabela14[[#This Row],[Data]],2)","v":7},2018,"Luty"]
["2018-02-16","Zmiana B",2418976,378,428,16,"Luty",{"$f":"WEEKNUM(Tabela14[[#This Row],[Data]],2)","v":7},2018,"Luty"]
["2018-02-16","Zmiana B",894,240,290,16,"Luty",{"$f":"WEEKNUM(Tabela14[[#This Row],[Data]],2)","v":7},2018,"Luty"]
["2018-02-16","Zmiana B",119,173,223,16,"Luty",{"$f":"WEEKNUM(Tabela14[[#This Row],[Data]],2)","v":7},2018,"Luty"]
["2018-02-16","Zmiana B",269,344,394,16,"Luty",{"$f":"WEEKNUM(Tabela14[[#This Row],[Data]],2)","v":7},2018,"Luty"]
["2018-02-16","Zmiana B",2001994,247,297,16,"Luty",{"$f":"WEEKNUM(Tabela14[[#This Row],[Data]],2)","v":7},2018,"Luty"]
["2018-02-16","Zmiana B",310,131,181,16,"Luty",{"$f":"WEEKNUM(Tabela14[[#This Row],[Data]],2)","v":7},2018,"Luty"]
["2018-02-16","Zmiana B",546,28,78,16,"Luty",{"$f":"WEEKNUM(Tabela14[[#This Row],[Data]],2)","v":7},2018,"Luty"]
["2018-02-17","Zmiana A","717F",666,716,17,"Luty",{"$f":"WEEKNUM(Tabela14[[#This Row],[Data]],2)","v":7},2018,"Luty"]
["2018-02-17","Zmiana A",69,329,379,17,"Luty",{"$f":"WEEKNUM(Tabela14[[#This Row],[Data]],2)","v":7},2018,"Luty"]
["2018-02-17","Zmiana A","33501F",99,149,17,"Luty",{"$f":"WEEKNUM(Tabela14[[#This Row],[Data]],2)","v":7},2018,"Luty"]
["2018-02-17","Zmiana A","802F",75,125,17,"Luty",{"$f":"WEEKNUM(Tabela14[[#This Row],[Data]],2)","v":7},2018,"Luty"]
["2018-02-17","Zmiana A",894,94,144,17,"Luty",{"$f":"WEEKNUM(Tabela14[[#This Row],[Data]],2)","v":7},2018,"Luty"]
["2018-02-17","Zmiana A",514,127,177,17,"Luty",{"$f":"WEEKNUM(Tabela14[[#This Row],[Data]],2)","v":7},2018,"Luty"]
["2018-02-17","Zmiana A",571,797,847,17,"Luty",{"$f":"WEEKNUM(Tabela14[[#This Row],[Data]],2)","v":7},2018,"Luty"]
["2018-02-17","Zmiana A",119,511,561,17,"Luty",{"$f":"WEEKNUM(Tabela14[[#This Row],[Data]],2)","v":7},2018,"Luty"]
["2018-02-19","Zmiana A",391,168,218,19,"Luty",{"$f":"WEEKNUM(Tabela14[[#This Row],[Data]],2)","v":8},2018,"Luty"]
["2018-02-19","Zmiana A",2297015,38,88,19,"Luty",{"$f":"WEEKNUM(Tabela14[[#This Row],[Data]],2)","v":8},2018,"Luty"]
["2018-02-19","Zmiana A",269,90,140,19,"Luty",{"$f":"WEEKNUM(Tabela14[[#This Row],[Data]],2)","v":8},2018,"Luty"]
["2018-02-19","Zmiana A",1901726,202,252,19,"Luty",{"$f":"WEEKNUM(Tabela14[[#This Row],[Data]],2)","v":8},2018,"Luty"]
["2018-02-19","Zmiana A",843,264,314,19,"Luty",{"$f":"WEEKNUM(Tabela14[[#This Row],[Data]],2)","v":8},2018,"Luty"]
["2018-02-19","Zmiana A",467,244,294,19,"Luty",{"$f":"WEEKNUM(Tabela14[[#This Row],[Data]],2)","v":8},2018,"Luty"]
["2018-02-19","Zmiana A",378,24,74,19,"Luty",{"$f":"WEEKNUM(Tabela14[[#This Row],[Data]],2)","v":8},2018,"Luty"]
["2018-02-19","Zmiana A",2334641,174,224,19,"Luty",{"$f":"WEEKNUM(Tabela14[[#This Row],[Data]],2)","v":8},2018,"Luty"]
["2018-02-19","Zmiana A",2001726,74,124,19,"Luty",{"$f":"WEEKNUM(Tabela14[[#This Row],[Data]],2)","v":8},2018,"Luty"]
["2018-02-19","Zmiana A",326,3089,3139,19,"Luty",{"$f":"WEEKNUM(Tabela14[[#This Row],[Data]],2)","v":8},2018,"Luty"]
["2018-02-19","Zmiana A",2451636,181,231,19,"Luty",{"$f":"WEEKNUM(Tabela14[[#This Row],[Data]],2)","v":8},2018,"Luty"]
["2018-02-19","Zmiana A",76,980,1030,19,"Luty",{"$f":"WEEKNUM(Tabela14[[#This Row],[Data]],2)","v":8},2018,"Luty"]
["2018-02-19","Zmiana B","702f",416,466,19,"Luty",{"$f":"WEEKNUM(Tabela14[[#This Row],[Data]],2)","v":8},2018,"Luty"]
["2018-02-19","Zmiana B",554,34,84,19,"Luty",{"$f":"WEEKNUM(Tabela14[[#This Row],[Data]],2)","v":8},2018,"Luty"]
["2018-02-19","Zmiana B","708f",640,690,19,"Luty",{"$f":"WEEKNUM(Tabela14[[#This Row],[Data]],2)","v":8},2018,"Luty"]
["2018-02-19","Zmiana B","33501F",435,485,19,"Luty",{"$f":"WEEKNUM(Tabela14[[#This Row],[Data]],2)","v":8},2018,"Luty"]
["2018-02-19","Zmiana B",570,614,664,{"$f":"IF(A834=\"\",\"\",DAY(A834))","v":19},{"$f":"IFERROR(VLOOKUP(IF(A834=\"\",\"\",MONTH(A834)),$P$3:$Q$14,2,FALSE),\"\")","v":"Luty"},{"$f":"WEEKNUM(Tabela14[[#This Row],[Data]],2)","v":8},{"$f":"IF(A834=\"\",\"\",YEAR(A834))","v":2018},{"$f":"G834","v":"Luty"}]
["2018-02-19","Zmiana B",212,87,137,19,"Luty",{"$f":"WEEKNUM(Tabela14[[#This Row],[Data]],2)","v":8},2018,"Luty"]
["2018-02-19","Zmiana B",2001994,36,86,19,"Luty",{"$f":"WEEKNUM(Tabela14[[#This Row],[Data]],2)","v":8},2018,"Luty"]
["2018-02-19","Zmiana B",21,25,75,19,"Luty",{"$f":"WEEKNUM(Tabela14[[#This Row],[Data]],2)","v":8},2018,"Luty"]
["2018-02-19","Zmiana C",498,2674,2724,19,"Luty",{"$f":"WEEKNUM(Tabela14[[#This Row],[Data]],2)","v":8},2018,"Luty"]
["2018-02-19","Zmiana C",2126381,66,116,19,"Luty",{"$f":"WEEKNUM(Tabela14[[#This Row],[Data]],2)","v":8},2018,"Luty"]
["2018-02-19","Zmiana C",2310044,749,799,19,"Luty",{"$f":"WEEKNUM(Tabela14[[#This Row],[Data]],2)","v":8},2018,"Luty"]
["2018-02-20","Zmiana A","33501F",320,370,20,"Luty",{"$f":"WEEKNUM(Tabela14[[#This Row],[Data]],2)","v":8},2018,"Luty"]
["2018-02-20","Zmiana A","717F",609,659,20,"Luty",{"$f":"WEEKNUM(Tabela14[[#This Row],[Data]],2)","v":8},2018,"Luty"]
["2018-02-20","Zmiana A","33505F",138,188,20,"Luty",{"$f":"WEEKNUM(Tabela14[[#This Row],[Data]],2)","v":8},2018,"Luty"]
["2018-02-20","Zmiana A",22,420,470,20,"Luty",{"$f":"WEEKNUM(Tabela14[[#This Row],[Data]],2)","v":8},2018,"Luty"]
["2018-02-20","Zmiana A",437,218,268,20,"Luty",{"$f":"WEEKNUM(Tabela14[[#This Row],[Data]],2)","v":8},2018,"Luty"]
["2018-02-20","Zmiana A",701,75,125,20,"Luty",{"$f":"WEEKNUM(Tabela14[[#This Row],[Data]],2)","v":8},2018,"Luty"]
["2018-02-20","Zmiana A",310,146,196,20,"Luty",{"$f":"WEEKNUM(Tabela14[[#This Row],[Data]],2)","v":8},2018,"Luty"]
["2018-02-20","Zmiana A",2001994,285,335,20,"Luty",{"$f":"WEEKNUM(Tabela14[[#This Row],[Data]],2)","v":8},2018,"Luty"]
["2018-02-20","Zmiana A",546,180,230,20,"Luty",{"$f":"WEEKNUM(Tabela14[[#This Row],[Data]],2)","v":8},2018,"Luty"]
["2018-02-20","Zmiana A",2203172,72,122,20,"Luty",{"$f":"WEEKNUM(Tabela14[[#This Row],[Data]],2)","v":8},2018,"Luty"]
["2018-02-20","Zmiana A",498,2639,2689,20,"Luty",{"$f":"WEEKNUM(Tabela14[[#This Row],[Data]],2)","v":8},2018,"Luty"]
["2018-02-20","Zmiana A","721F",445,495,20,"Luty",{"$f":"WEEKNUM(Tabela14[[#This Row],[Data]],2)","v":8},2018,"Luty"]
["2018-02-20","Zmiana A",2432300,647,697,20,"Luty",{"$f":"WEEKNUM(Tabela14[[#This Row],[Data]],2)","v":8},2018,"Luty"]
["2018-02-20","Zmiana B",2432300,512,562,20,"Luty",{"$f":"WEEKNUM(Tabela14[[#This Row],[Data]],2)","v":8},2018,"Luty"]
["2018-02-20","Zmiana B",1533713,1,51,20,"Luty",{"$f":"WEEKNUM(Tabela14[[#This Row],[Data]],2)","v":8},2018,"Luty"]
["2018-02-20","Zmiana B",560,736,786,20,"Luty",{"$f":"WEEKNUM(Tabela14[[#This Row],[Data]],2)","v":8},2018,"Luty"]
["2018-02-20","Zmiana B",2149709,344,394,20,"Luty",{"$f":"WEEKNUM(Tabela14[[#This Row],[Data]],2)","v":8},2018,"Luty"]
["2018-02-20","Zmiana C",198,550,600,20,"Luty",{"$f":"WEEKNUM(Tabela14[[#This Row],[Data]],2)","v":8},2018,"Luty"]
["2018-02-20","Zmiana C",845,201,251,20,"Luty",{"$f":"WEEKNUM(Tabela14[[#This Row],[Data]],2)","v":8},2018,"Luty"]
["2018-02-20","Zmiana C",179,354,404,20,"Luty",{"$f":"WEEKNUM(Tabela14[[#This Row],[Data]],2)","v":8},2018,"Luty"]
["2018-02-20","Zmiana C",498,2569,2619,20,"Luty",{"$f":"WEEKNUM(Tabela14[[#This Row],[Data]],2)","v":8},2018,"Luty"]
["2018-02-20","Zmiana C",310,67,117,20,"Luty",{"$f":"WEEKNUM(Tabela14[[#This Row],[Data]],2)","v":8},2018,"Luty"]
["2018-02-21","Zmiana A","717F",167,217,21,"Luty",{"$f":"WEEKNUM(Tabela14[[#This Row],[Data]],2)","v":8},2018,"Luty"]
["2018-02-21","Zmiana A","33503F",445,495,21,"Luty",{"$f":"WEEKNUM(Tabela14[[#This Row],[Data]],2)","v":8},2018,"Luty"]
["2018-02-21","Zmiana A",570,15,65,21,"Luty",{"$f":"WEEKNUM(Tabela14[[#This Row],[Data]],2)","v":8},2018,"Luty"]
["2018-02-21","Zmiana A",2067417,265,315,21,"Luty",{"$f":"WEEKNUM(Tabela14[[#This Row],[Data]],2)","v":8},2018,"Luty"]
["2018-02-21","Zmiana A",418,8,58,21,"Luty",{"$f":"WEEKNUM(Tabela14[[#This Row],[Data]],2)","v":8},2018,"Luty"]
["2018-02-21","Zmiana A",179,795,845,21,"Luty",{"$f":"WEEKNUM(Tabela14[[#This Row],[Data]],2)","v":8},2018,"Luty"]
["2018-02-21","Zmiana A","33501F",589,639,21,"Luty",{"$f":"WEEKNUM(Tabela14[[#This Row],[Data]],2)","v":8},2018,"Luty"]
["2018-02-21","Zmiana A",702,94,144,21,"Luty",{"$f":"WEEKNUM(Tabela14[[#This Row],[Data]],2)","v":8},2018,"Luty"]
["2018-02-21","Zmiana A",319,34,84,21,"Luty",{"$f":"WEEKNUM(Tabela14[[#This Row],[Data]],2)","v":8},2018,"Luty"]
["2018-02-21","Zmiana A",2451636,52,102,21,"Luty",{"$f":"WEEKNUM(Tabela14[[#This Row],[Data]],2)","v":8},2018,"Luty"]
["2018-02-21","Zmiana A",780,237,287,21,"Luty",{"$f":"WEEKNUM(Tabela14[[#This Row],[Data]],2)","v":8},2018,"Luty"]
["2018-02-21","Zmiana A",414,296,346,21,"Luty",{"$f":"WEEKNUM(Tabela14[[#This Row],[Data]],2)","v":8},2018,"Luty"]
["2018-02-21","Zmiana A",958,192,242,21,"Luty",{"$f":"WEEKNUM(Tabela14[[#This Row],[Data]],2)","v":8},2018,"Luty"]
["2018-02-21","Zmiana A",326,2770,2820,21,"Luty",{"$f":"WEEKNUM(Tabela14[[#This Row],[Data]],2)","v":8},2018,"Luty"]
["2018-02-21","Zmiana A",872,273,323,21,"Luty",{"$f":"WEEKNUM(Tabela14[[#This Row],[Data]],2)","v":8},2018,"Luty"]
["2018-02-21","Zmiana A",2296305,348,398,21,"Luty",{"$f":"WEEKNUM(Tabela14[[#This Row],[Data]],2)","v":8},2018,"Luty"]
["2018-02-21","Zmiana C",198,586,636,21,"Luty",{"$f":"WEEKNUM(Tabela14[[#This Row],[Data]],2)","v":8},2018,"Luty"]
["2018-02-21","Zmiana C",845,53,103,21,"Luty",{"$f":"WEEKNUM(Tabela14[[#This Row],[Data]],2)","v":8},2018,"Luty"]
["2018-02-21","Zmiana C",179,614,664,21,"Luty",{"$f":"WEEKNUM(Tabela14[[#This Row],[Data]],2)","v":8},2018,"Luty"]
["2018-02-21","Zmiana C",498,2586,2636,21,"Luty",{"$f":"WEEKNUM(Tabela14[[#This Row],[Data]],2)","v":8},2018,"Luty"]
["2018-02-21","Zmiana C",310,98,148,21,"Luty",{"$f":"WEEKNUM(Tabela14[[#This Row],[Data]],2)","v":8},2018,"Luty"]
["2018-02-21","Zmiana C",31,521,571,21,"Luty",{"$f":"WEEKNUM(Tabela14[[#This Row],[Data]],2)","v":8},2018,"Luty"]
["2018-02-21","Zmiana C",780,426,476,21,"Luty",{"$f":"WEEKNUM(Tabela14[[#This Row],[Data]],2)","v":8},2018,"Luty"]
["2018-02-21","Zmiana C",498,2429,2479,21,"Luty",{"$f":"WEEKNUM(Tabela14[[#This Row],[Data]],2)","v":8},2018,"Luty"]
["2018-02-22","Zmiana B",2126381,300,350,22,"Luty",{"$f":"WEEKNUM(Tabela14[[#This Row],[Data]],2)","v":8},2018,"Luty"]
["2018-02-22","Zmiana B",617,137,187,22,"Luty",{"$f":"WEEKNUM(Tabela14[[#This Row],[Data]],2)","v":8},2018,"Luty"]
["2018-02-22","Zmiana B",616,69,119,22,"Luty",{"$f":"WEEKNUM(Tabela14[[#This Row],[Data]],2)","v":8},2018,"Luty"]
["2018-02-22","Zmiana B",142,129,179,22,"Luty",{"$f":"WEEKNUM(Tabela14[[#This Row],[Data]],2)","v":8},2018,"Luty"]
["2018-02-22","Zmiana B",101,248,298,22,"Luty",{"$f":"WEEKNUM(Tabela14[[#This Row],[Data]],2)","v":8},2018,"Luty"]
["2018-02-22","Zmiana B",2297015,402,452,22,"Luty",{"$f":"WEEKNUM(Tabela14[[#This Row],[Data]],2)","v":8},2018,"Luty"]
["2018-02-22","Zmiana C",839,267,317,22,"Luty",{"$f":"WEEKNUM(Tabela14[[#This Row],[Data]],2)","v":8},2018,"Luty"]
["2018-02-22","Zmiana C",2451635,36,86,22,"Luty",{"$f":"WEEKNUM(Tabela14[[#This Row],[Data]],2)","v":8},2018,"Luty"]
["2018-02-22","Zmiana C",310,177,227,22,"Luty",{"$f":"WEEKNUM(Tabela14[[#This Row],[Data]],2)","v":8},2018,"Luty"]
["2018-02-22","Zmiana C",212,109,159,22,"Luty",{"$f":"WEEKNUM(Tabela14[[#This Row],[Data]],2)","v":8},2018,"Luty"]
["2018-02-22","Zmiana C",326,2402,2452,22,"Luty",{"$f":"WEEKNUM(Tabela14[[#This Row],[Data]],2)","v":8},2018,"Luty"]
["2018-02-23","Zmiana A","300F",415,465,{"$f":"IF(A898=\"\",\"\",DAY(A898))","v":23},{"$f":"IFERROR(VLOOKUP(IF(A898=\"\",\"\",MONTH(A898)),$P$3:$Q$14,2,FALSE),\"\")","v":"Luty"},{"$f":"WEEKNUM(Tabela14[[#This Row],[Data]],2)","v":8},{"$f":"IF(A898=\"\",\"\",YEAR(A898))","v":2018},{"$f":"G898","v":"Luty"}]
["2018-02-23","Zmiana A","717F",565,615,23,"Luty",{"$f":"WEEKNUM(Tabela14[[#This Row],[Data]],2)","v":8},2018,"Luty"]
["2018-02-23","Zmiana A",2067417,294,344,23,"Luty",{"$f":"WEEKNUM(Tabela14[[#This Row],[Data]],2)","v":8},2018,"Luty"]
["2018-02-23","Zmiana A",2001723,64,114,23,"Luty",{"$f":"WEEKNUM(Tabela14[[#This Row],[Data]],2)","v":8},2018,"Luty"]
["2018-02-23","Zmiana A",2451635,67,117,23,"Luty",{"$f":"WEEKNUM(Tabela14[[#This Row],[Data]],2)","v":8},2018,"Luty"]
["2018-02-23","Zmiana A",2297015,473,523,23,"Luty",{"$f":"WEEKNUM(Tabela14[[#This Row],[Data]],2)","v":8},2018,"Luty"]
["2018-02-23","Zmiana A",2030723,28,78,23,"Luty",{"$f":"WEEKNUM(Tabela14[[#This Row],[Data]],2)","v":8},2018,"Luty"]
["2018-02-23","Zmiana A",160,266,316,23,"Luty",{"$f":"WEEKNUM(Tabela14[[#This Row],[Data]],2)","v":8},2018,"Luty"]
["2018-02-23","Zmiana A",543,300,350,23,"Luty",{"$f":"WEEKNUM(Tabela14[[#This Row],[Data]],2)","v":8},2018,"Luty"]
["2018-02-23","Zmiana A",326,2961,3011,23,"Luty",{"$f":"WEEKNUM(Tabela14[[#This Row],[Data]],2)","v":8},2018,"Luty"]
["2018-02-23","Zmiana A",812,752,802,23,"Luty",{"$f":"WEEKNUM(Tabela14[[#This Row],[Data]],2)","v":8},2018,"Luty"]
["2018-02-23","Zmiana A",2149709,458,508,23,"Luty",{"$f":"WEEKNUM(Tabela14[[#This Row],[Data]],2)","v":8},2018,"Luty"]
["2018-02-23","Zmiana A",119,3,53,23,"Luty",{"$f":"WEEKNUM(Tabela14[[#This Row],[Data]],2)","v":8},2018,"Luty"]
["2018-02-23","Zmiana A","300F",55,105,23,"Luty",{"$f":"WEEKNUM(Tabela14[[#This Row],[Data]],2)","v":8},2018,"Luty"]
["2018-02-23","Zmiana A","717F",615,665,23,"Luty",{"$f":"WEEKNUM(Tabela14[[#This Row],[Data]],2)","v":8},2018,"Luty"]
["2018-02-23","Zmiana A",2067417,61,111,23,"Luty",{"$f":"WEEKNUM(Tabela14[[#This Row],[Data]],2)","v":8},2018,"Luty"]
["2018-02-23","Zmiana A",2001723,194,244,23,"Luty",{"$f":"WEEKNUM(Tabela14[[#This Row],[Data]],2)","v":8},2018,"Luty"]
["2018-02-23","Zmiana A",2451635,250,300,23,"Luty",{"$f":"WEEKNUM(Tabela14[[#This Row],[Data]],2)","v":8},2018,"Luty"]
["2018-02-23","Zmiana A",2297015,615,665,23,"Luty",{"$f":"WEEKNUM(Tabela14[[#This Row],[Data]],2)","v":8},2018,"Luty"]
["2018-02-23","Zmiana A",2030723,33,83,23,"Luty",{"$f":"WEEKNUM(Tabela14[[#This Row],[Data]],2)","v":8},2018,"Luty"]
["2018-02-23","Zmiana A",160,183,233,23,"Luty",{"$f":"WEEKNUM(Tabela14[[#This Row],[Data]],2)","v":8},2018,"Luty"]
["2018-02-23","Zmiana A",543,209,259,23,"Luty",{"$f":"WEEKNUM(Tabela14[[#This Row],[Data]],2)","v":8},2018,"Luty"]
["2018-02-23","Zmiana A",326,2924,2974,23,"Luty",{"$f":"WEEKNUM(Tabela14[[#This Row],[Data]],2)","v":8},2018,"Luty"]
["2018-02-23","Zmiana A",812,905,955,23,"Luty",{"$f":"WEEKNUM(Tabela14[[#This Row],[Data]],2)","v":8},2018,"Luty"]
["2018-02-23","Zmiana A",2149709,210,260,23,"Luty",{"$f":"WEEKNUM(Tabela14[[#This Row],[Data]],2)","v":8},2018,"Luty"]
["2018-02-23","Zmiana A",119,287,337,23,"Luty",{"$f":"WEEKNUM(Tabela14[[#This Row],[Data]],2)","v":8},2018,"Luty"]
["2018-02-23","Zmiana C",48,74,124,23,"Luty",{"$f":"WEEKNUM(Tabela14[[#This Row],[Data]],2)","v":8},2018,"Luty"]
["2018-02-23","Zmiana C",47,324,374,23,"Luty",{"$f":"WEEKNUM(Tabela14[[#This Row],[Data]],2)","v":8},2018,"Luty"]
["2018-02-23","Zmiana C",894,392,442,23,"Luty",{"$f":"WEEKNUM(Tabela14[[#This Row],[Data]],2)","v":8},2018,"Luty"]
["2018-02-23","Zmiana C",933,153,203,23,"Luty",{"$f":"WEEKNUM(Tabela14[[#This Row],[Data]],2)","v":8},2018,"Luty"]
["2018-02-23","Zmiana C",498,2331,2381,23,"Luty",{"$f":"WEEKNUM(Tabela14[[#This Row],[Data]],2)","v":8},2018,"Luty"]
["2018-02-23","Zmiana C",1745895,130,180,23,"Luty",{"$f":"WEEKNUM(Tabela14[[#This Row],[Data]],2)","v":8},2018,"Luty"]
["2018-02-23","Zmiana C",845,308,358,23,"Luty",{"$f":"WEEKNUM(Tabela14[[#This Row],[Data]],2)","v":8},2018,"Luty"]
["2018-02-24","Zmiana A",1533713,413,463,24,"Luty",{"$f":"WEEKNUM(Tabela14[[#This Row],[Data]],2)","v":8},2018,"Luty"]
["2018-02-24","Zmiana A",76,181,231,24,"Luty",{"$f":"WEEKNUM(Tabela14[[#This Row],[Data]],2)","v":8},2018,"Luty"]
["2018-02-24","Zmiana A",119,426,476,24,"Luty",{"$f":"WEEKNUM(Tabela14[[#This Row],[Data]],2)","v":8},2018,"Luty"]
["2018-02-24","Zmiana A","s122309",326,376,24,"Luty",{"$f":"WEEKNUM(Tabela14[[#This Row],[Data]],2)","v":8},2018,"Luty"]
["2018-02-26","Zmiana A",839,128,178,26,"Luty",{"$f":"WEEKNUM(Tabela14[[#This Row],[Data]],2)","v":9},2018,"Luty"]
["2018-02-26","Zmiana A",560,120,170,26,"Luty",{"$f":"WEEKNUM(Tabela14[[#This Row],[Data]],2)","v":9},2018,"Luty"]
["2018-02-26","Zmiana A",575,127,177,26,"Luty",{"$f":"WEEKNUM(Tabela14[[#This Row],[Data]],2)","v":9},2018,"Luty"]
["2018-02-26","Zmiana A",2035613,36,86,26,"Luty",{"$f":"WEEKNUM(Tabela14[[#This Row],[Data]],2)","v":9},2018,"Luty"]
["2018-02-26","Zmiana A",2297015,14,64,26,"Luty",{"$f":"WEEKNUM(Tabela14[[#This Row],[Data]],2)","v":9},2018,"Luty"]
["2018-02-26","Zmiana A","717F",665,715,26,"Luty",{"$f":"WEEKNUM(Tabela14[[#This Row],[Data]],2)","v":9},2018,"Luty"]
["2018-02-26","Zmiana A",416,30,80,26,"Luty",{"$f":"WEEKNUM(Tabela14[[#This Row],[Data]],2)","v":9},2018,"Luty"]
["2018-02-26","Zmiana A",958,92,142,26,"Luty",{"$f":"WEEKNUM(Tabela14[[#This Row],[Data]],2)","v":9},2018,"Luty"]
["2018-02-26","Zmiana A","716F",363,413,26,"Luty",{"$f":"WEEKNUM(Tabela14[[#This Row],[Data]],2)","v":9},2018,"Luty"]
["2018-02-26","Zmiana A",2001723,14,64,26,"Luty",{"$f":"WEEKNUM(Tabela14[[#This Row],[Data]],2)","v":9},2018,"Luty"]
["2018-02-26","Zmiana A",25,61,111,26,"Luty",{"$f":"WEEKNUM(Tabela14[[#This Row],[Data]],2)","v":9},2018,"Luty"]
["2018-02-26","Zmiana A",871,168,218,26,"Luty",{"$f":"WEEKNUM(Tabela14[[#This Row],[Data]],2)","v":9},2018,"Luty"]
["2018-02-26","Zmiana A",469,387,437,26,"Luty",{"$f":"WEEKNUM(Tabela14[[#This Row],[Data]],2)","v":9},2018,"Luty"]
["2018-02-26","Zmiana A",326,2622,2672,26,"Luty",{"$f":"WEEKNUM(Tabela14[[#This Row],[Data]],2)","v":9},2018,"Luty"]
["2018-02-26","Zmiana A",514,71,121,26,"Luty",{"$f":"WEEKNUM(Tabela14[[#This Row],[Data]],2)","v":9},2018,"Luty"]
["2018-02-26","Zmiana A",76,818,868,26,"Luty",{"$f":"WEEKNUM(Tabela14[[#This Row],[Data]],2)","v":9},2018,"Luty"]
["2018-02-26","Zmiana A",2408708,690,740,26,"Luty",{"$f":"WEEKNUM(Tabela14[[#This Row],[Data]],2)","v":9},2018,"Luty"]
["2018-02-26","Zmiana B",37,79,129,26,"Luty",{"$f":"WEEKNUM(Tabela14[[#This Row],[Data]],2)","v":9},2018,"Luty"]
["2018-02-26","Zmiana B",160,14,64,26,"Luty",{"$f":"WEEKNUM(Tabela14[[#This Row],[Data]],2)","v":9},2018,"Luty"]
["2018-02-26","Zmiana B","33501F",149,199,26,"Luty",{"$f":"WEEKNUM(Tabela14[[#This Row],[Data]],2)","v":9},2018,"Luty"]
["2018-02-26","Zmiana B","33505F",405,455,26,"Luty",{"$f":"WEEKNUM(Tabela14[[#This Row],[Data]],2)","v":9},2018,"Luty"]
["2018-02-26","Zmiana B","722F",366,416,26,"Luty",{"$f":"WEEKNUM(Tabela14[[#This Row],[Data]],2)","v":9},2018,"Luty"]
["2018-02-26","Zmiana B",787,655,705,26,"Luty",{"$f":"WEEKNUM(Tabela14[[#This Row],[Data]],2)","v":9},2018,"Luty"]
["2018-02-26","Zmiana A",839,317,367,26,"Luty",{"$f":"WEEKNUM(Tabela14[[#This Row],[Data]],2)","v":9},2018,"Luty"]
["2018-02-26","Zmiana A",560,30,80,26,"Luty",{"$f":"WEEKNUM(Tabela14[[#This Row],[Data]],2)","v":9},2018,"Luty"]
["2018-02-26","Zmiana A",575,275,325,26,"Luty",{"$f":"WEEKNUM(Tabela14[[#This Row],[Data]],2)","v":9},2018,"Luty"]
["2018-02-26","Zmiana A",2035613,67,117,26,"Luty",{"$f":"WEEKNUM(Tabela14[[#This Row],[Data]],2)","v":9},2018,"Luty"]
["2018-02-26","Zmiana A",2297015,8,58,{"$f":"IF(A962=\"\",\"\",DAY(A962))","v":26},{"$f":"IFERROR(VLOOKUP(IF(A962=\"\",\"\",MONTH(A962)),$P$3:$Q$14,2,FALSE),\"\")","v":"Luty"},{"$f":"WEEKNUM(Tabela14[[#This Row],[Data]],2)","v":9},{"$f":"IF(A962=\"\",\"\",YEAR(A962))","v":2018},{"$f":"G962","v":"Luty"}]
["2018-02-26","Zmiana A","717F",597,647,26,"Luty",{"$f":"WEEKNUM(Tabela14[[#This Row],[Data]],2)","v":9},2018,"Luty"]
["2018-02-26","Zmiana A",416,251,301,26,"Luty",{"$f":"WEEKNUM(Tabela14[[#This Row],[Data]],2)","v":9},2018,"Luty"]
["2018-02-26","Zmiana A",958,301,351,26,"Luty",{"$f":"WEEKNUM(Tabela14[[#This Row],[Data]],2)","v":9},2018,"Luty"]
["2018-02-26","Zmiana A","716F",390,440,26,"Luty",{"$f":"WEEKNUM(Tabela14[[#This Row],[Data]],2)","v":9},2018,"Luty"]
["2018-02-26","Zmiana A",2001723,69,119,26,"Luty",{"$f":"WEEKNUM(Tabela14[[#This Row],[Data]],2)","v":9},2018,"Luty"]
["2018-02-26","Zmiana A",25,70,120,26,"Luty",{"$f":"WEEKNUM(Tabela14[[#This Row],[Data]],2)","v":9},2018,"Luty"]
["2018-02-26","Zmiana A",871,196,246,26,"Luty",{"$f":"WEEKNUM(Tabela14[[#This Row],[Data]],2)","v":9},2018,"Luty"]
["2018-02-26","Zmiana A",469,472,522,26,"Luty",{"$f":"WEEKNUM(Tabela14[[#This Row],[Data]],2)","v":9},2018,"Luty"]
["2018-02-26","Zmiana A",326,2959,3009,26,"Luty",{"$f":"WEEKNUM(Tabela14[[#This Row],[Data]],2)","v":9},2018,"Luty"]
["2018-02-26","Zmiana A",514,35,85,26,"Luty",{"$f":"WEEKNUM(Tabela14[[#This Row],[Data]],2)","v":9},2018,"Luty"]
["2018-02-26","Zmiana A",76,534,584,26,"Luty",{"$f":"WEEKNUM(Tabela14[[#This Row],[Data]],2)","v":9},2018,"Luty"]
["2018-02-26","Zmiana A",2408708,704,754,26,"Luty",{"$f":"WEEKNUM(Tabela14[[#This Row],[Data]],2)","v":9},2018,"Luty"]
["2018-02-26","Zmiana C",358,109,159,26,"Luty",{"$f":"WEEKNUM(Tabela14[[#This Row],[Data]],2)","v":9},2018,"Luty"]
["2018-02-26","Zmiana C",356,309,359,26,"Luty",{"$f":"WEEKNUM(Tabela14[[#This Row],[Data]],2)","v":9},2018,"Luty"]
["2018-02-26","Zmiana C",2310044,274,324,26,"Luty",{"$f":"WEEKNUM(Tabela14[[#This Row],[Data]],2)","v":9},2018,"Luty"]
["2018-02-26","Zmiana C",498,2580,2630,26,"Luty",{"$f":"WEEKNUM(Tabela14[[#This Row],[Data]],2)","v":9},2018,"Luty"]
["2018-02-26","Zmiana C",2451636,343,393,26,"Luty",{"$f":"WEEKNUM(Tabela14[[#This Row],[Data]],2)","v":9},2018,"Luty"]
["2018-02-27","Zmiana A","300F",162,212,27,"Luty",{"$f":"WEEKNUM(Tabela14[[#This Row],[Data]],2)","v":9},2018,"Luty"]
["2018-02-27","Zmiana A","802F",68,118,27,"Luty",{"$f":"WEEKNUM(Tabela14[[#This Row],[Data]],2)","v":9},2018,"Luty"]
["2018-02-27","Zmiana A",514,12,62,27,"Luty",{"$f":"WEEKNUM(Tabela14[[#This Row],[Data]],2)","v":9},2018,"Luty"]
["2018-02-27","Zmiana A",701,116,166,27,"Luty",{"$f":"WEEKNUM(Tabela14[[#This Row],[Data]],2)","v":9},2018,"Luty"]
["2018-02-27","Zmiana A",2310044,287,337,27,"Luty",{"$f":"WEEKNUM(Tabela14[[#This Row],[Data]],2)","v":9},2018,"Luty"]
["2018-02-27","Zmiana A",2435318,75,125,27,"Luty",{"$f":"WEEKNUM(Tabela14[[#This Row],[Data]],2)","v":9},2018,"Luty"]
["2018-02-27","Zmiana A",888,29,79,27,"Luty",{"$f":"WEEKNUM(Tabela14[[#This Row],[Data]],2)","v":9},2018,"Luty"]
["2018-02-27","Zmiana A",1533713,294,344,27,"Luty",{"$f":"WEEKNUM(Tabela14[[#This Row],[Data]],2)","v":9},2018,"Luty"]
["2018-02-27","Zmiana A",418,46,96,27,"Luty",{"$f":"WEEKNUM(Tabela14[[#This Row],[Data]],2)","v":9},2018,"Luty"]
["2018-02-27","Zmiana A",341,231,281,27,"Luty",{"$f":"WEEKNUM(Tabela14[[#This Row],[Data]],2)","v":9},2018,"Luty"]
["2018-02-27","Zmiana A",498,2898,2948,27,"Luty",{"$f":"WEEKNUM(Tabela14[[#This Row],[Data]],2)","v":9},2018,"Luty"]
["2018-02-27","Zmiana A",726,268,318,27,"Luty",{"$f":"WEEKNUM(Tabela14[[#This Row],[Data]],2)","v":9},2018,"Luty"]
["2018-02-27","Zmiana A","300F",154,204,27,"Luty",{"$f":"WEEKNUM(Tabela14[[#This Row],[Data]],2)","v":9},2018,"Luty"]
["2018-02-27","Zmiana A","334F",823,873,27,"Luty",{"$f":"WEEKNUM(Tabela14[[#This Row],[Data]],2)","v":9},2018,"Luty"]
["2018-02-27","Zmiana B",198,398,448,27,"Luty",{"$f":"WEEKNUM(Tabela14[[#This Row],[Data]],2)","v":9},2018,"Luty"]
["2018-02-27","Zmiana B",160,430,480,27,"Luty",{"$f":"WEEKNUM(Tabela14[[#This Row],[Data]],2)","v":9},2018,"Luty"]
["2018-02-27","Zmiana B",153,132,182,27,"Luty",{"$f":"WEEKNUM(Tabela14[[#This Row],[Data]],2)","v":9},2018,"Luty"]
["2018-02-27","Zmiana B",2538162,242,292,27,"Luty",{"$f":"WEEKNUM(Tabela14[[#This Row],[Data]],2)","v":9},2018,"Luty"]
["2018-02-27","Zmiana B",2432300,400,450,27,"Luty",{"$f":"WEEKNUM(Tabela14[[#This Row],[Data]],2)","v":9},2018,"Luty"]
["2018-02-27","Zmiana B",431,58,108,27,"Luty",{"$f":"WEEKNUM(Tabela14[[#This Row],[Data]],2)","v":9},2018,"Luty"]
["2018-02-27","Zmiana A",839,215,265,27,"Luty",{"$f":"WEEKNUM(Tabela14[[#This Row],[Data]],2)","v":9},2018,"Luty"]
["2018-02-27","Zmiana A",560,185,235,27,"Luty",{"$f":"WEEKNUM(Tabela14[[#This Row],[Data]],2)","v":9},2018,"Luty"]
["2018-02-27","Zmiana A",575,99,149,27,"Luty",{"$f":"WEEKNUM(Tabela14[[#This Row],[Data]],2)","v":9},2018,"Luty"]
["2018-02-27","Zmiana A",2035613,176,226,27,"Luty",{"$f":"WEEKNUM(Tabela14[[#This Row],[Data]],2)","v":9},2018,"Luty"]
["2018-02-27","Zmiana A",2297015,316,366,27,"Luty",{"$f":"WEEKNUM(Tabela14[[#This Row],[Data]],2)","v":9},2018,"Luty"]
["2018-02-27","Zmiana A","717F",701,751,27,"Luty",{"$f":"WEEKNUM(Tabela14[[#This Row],[Data]],2)","v":9},2018,"Luty"]
["2018-02-27","Zmiana A",416,278,328,27,"Luty",{"$f":"WEEKNUM(Tabela14[[#This Row],[Data]],2)","v":9},2018,"Luty"]
["2018-02-27","Zmiana A",958,27,77,27,"Luty",{"$f":"WEEKNUM(Tabela14[[#This Row],[Data]],2)","v":9},2018,"Luty"]
["2018-02-27","Zmiana A","716F",664,714,27,"Luty",{"$f":"WEEKNUM(Tabela14[[#This Row],[Data]],2)","v":9},2018,"Luty"]
["2018-02-27","Zmiana A",2001723,24,74,27,"Luty",{"$f":"WEEKNUM(Tabela14[[#This Row],[Data]],2)","v":9},2018,"Luty"]
["2018-02-27","Zmiana A",25,77,127,27,"Luty",{"$f":"WEEKNUM(Tabela14[[#This Row],[Data]],2)","v":9},2018,"Luty"]
["2018-02-27","Zmiana A",871,149,199,27,"Luty",{"$f":"WEEKNUM(Tabela14[[#This Row],[Data]],2)","v":9},2018,"Luty"]
["2018-02-27","Zmiana A",469,384,434,27,"Luty",{"$f":"WEEKNUM(Tabela14[[#This Row],[Data]],2)","v":9},2018,"Luty"]
["2018-02-27","Zmiana A",326,2771,2821,27,"Luty",{"$f":"WEEKNUM(Tabela14[[#This Row],[Data]],2)","v":9},2018,"Luty"]
["2018-02-27","Zmiana A",514,15,65,27,"Luty",{"$f":"WEEKNUM(Tabela14[[#This Row],[Data]],2)","v":9},2018,"Luty"]
["2018-02-27","Zmiana A",76,700,750,27,"Luty",{"$f":"WEEKNUM(Tabela14[[#This Row],[Data]],2)","v":9},2018,"Luty"]
["2018-02-27","Zmiana A",2408708,433,483,27,"Luty",{"$f":"WEEKNUM(Tabela14[[#This Row],[Data]],2)","v":9},2018,"Luty"]
["2018-02-27","Zmiana C",498,408,458,27,"Luty",{"$f":"WEEKNUM(Tabela14[[#This Row],[Data]],2)","v":9},2018,"Luty"]
["2018-02-27","Zmiana C",326,2112,2162,27,"Luty",{"$f":"WEEKNUM(Tabela14[[#This Row],[Data]],2)","v":9},2018,"Luty"]
["2018-02-27","Zmiana C",2451635,284,334,27,"Luty",{"$f":"WEEKNUM(Tabela14[[#This Row],[Data]],2)","v":9},2018,"Luty"]
["2018-02-27","Zmiana C",2451636,271,321,27,"Luty",{"$f":"WEEKNUM(Tabela14[[#This Row],[Data]],2)","v":9},2018,"Luty"]
["2018-02-27","Zmiana C",701,67,117,27,"Luty",{"$f":"WEEKNUM(Tabela14[[#This Row],[Data]],2)","v":9},2018,"Luty"]
["2018-02-27","Zmiana C",733,286,336,27,"Luty",{"$f":"WEEKNUM(Tabela14[[#This Row],[Data]],2)","v":9},2018,"Luty"]
["2018-02-28","Zmiana A",839,172,222,28,"Luty",{"$f":"WEEKNUM(Tabela14[[#This Row],[Data]],2)","v":9},2018,"Luty"]
["2018-02-28","Zmiana A",560,152,202,28,"Luty",{"$f":"WEEKNUM(Tabela14[[#This Row],[Data]],2)","v":9},2018,"Luty"]
["2018-02-28","Zmiana A",575,36,86,28,"Luty",{"$f":"WEEKNUM(Tabela14[[#This Row],[Data]],2)","v":9},2018,"Luty"]
["2018-02-28","Zmiana A",2035613,186,236,{"$f":"IF(A1026=\"\",\"\",DAY(A1026))","v":28},{"$f":"IFERROR(VLOOKUP(IF(A1026=\"\",\"\",MONTH(A1026)),$P$3:$Q$14,2,FALSE),\"\")","v":"Luty"},{"$f":"WEEKNUM(Tabela14[[#This Row],[Data]],2)","v":9},{"$f":"IF(A1026=\"\",\"\",YEAR(A1026))","v":2018},{"$f":"G1026","v":"Luty"}]
["2018-02-28","Zmiana A",2297015,123,173,28,"Luty",{"$f":"WEEKNUM(Tabela14[[#This Row],[Data]],2)","v":9},2018,"Luty"]
["2018-02-28","Zmiana A","717F",636,686,28,"Luty",{"$f":"WEEKNUM(Tabela14[[#This Row],[Data]],2)","v":9},2018,"Luty"]
["2018-02-28","Zmiana A",416,0,50,28,"Luty",{"$f":"WEEKNUM(Tabela14[[#This Row],[Data]],2)","v":9},2018,"Luty"]
["2018-02-28","Zmiana A",958,267,317,28,"Luty",{"$f":"WEEKNUM(Tabela14[[#This Row],[Data]],2)","v":9},2018,"Luty"]
["2018-02-28","Zmiana A","716F",327,377,28,"Luty",{"$f":"WEEKNUM(Tabela14[[#This Row],[Data]],2)","v":9},2018,"Luty"]
["2018-02-28","Zmiana A",2001723,168,218,28,"Luty",{"$f":"WEEKNUM(Tabela14[[#This Row],[Data]],2)","v":9},2018,"Luty"]
["2018-02-28","Zmiana A",25,141,191,28,"Luty",{"$f":"WEEKNUM(Tabela14[[#This Row],[Data]],2)","v":9},2018,"Luty"]
["2018-02-28","Zmiana A",871,198,248,28,"Luty",{"$f":"WEEKNUM(Tabela14[[#This Row],[Data]],2)","v":9},2018,"Luty"]
["2018-02-28","Zmiana A",469,136,186,28,"Luty",{"$f":"WEEKNUM(Tabela14[[#This Row],[Data]],2)","v":9},2018,"Luty"]
["2018-02-28","Zmiana A",326,2892,2942,28,"Luty",{"$f":"WEEKNUM(Tabela14[[#This Row],[Data]],2)","v":9},2018,"Luty"]
["2018-02-28","Zmiana A",514,246,296,28,"Luty",{"$f":"WEEKNUM(Tabela14[[#This Row],[Data]],2)","v":9},2018,"Luty"]
["2018-02-28","Zmiana A",76,513,563,28,"Luty",{"$f":"WEEKNUM(Tabela14[[#This Row],[Data]],2)","v":9},2018,"Luty"]
["2018-02-28","Zmiana A",2408708,577,627,28,"Luty",{"$f":"WEEKNUM(Tabela14[[#This Row],[Data]],2)","v":9},2018,"Luty"]
["2018-02-28","Zmiana B",844,338,388,28,"Luty",{"$f":"WEEKNUM(Tabela14[[#This Row],[Data]],2)","v":9},2018,"Luty"]
["2018-02-28","Zmiana B",845,208,258,28,"Luty",{"$f":"WEEKNUM(Tabela14[[#This Row],[Data]],2)","v":9},2018,"Luty"]
["2018-02-28","Zmiana B",513,90,140,28,"Luty",{"$f":"WEEKNUM(Tabela14[[#This Row],[Data]],2)","v":9},2018,"Luty"]
["2018-02-28","Zmiana B",2408709,132,182,28,"Luty",{"$f":"WEEKNUM(Tabela14[[#This Row],[Data]],2)","v":9},2018,"Luty"]
["2018-02-28","Zmiana B",119,584,634,28,"Luty",{"$f":"WEEKNUM(Tabela14[[#This Row],[Data]],2)","v":9},2018,"Luty"]
["2018-02-28","Zmiana A",839,207,257,28,"Luty",{"$f":"WEEKNUM(Tabela14[[#This Row],[Data]],2)","v":9},2018,"Luty"]
["2018-02-28","Zmiana A",560,171,221,28,"Luty",{"$f":"WEEKNUM(Tabela14[[#This Row],[Data]],2)","v":9},2018,"Luty"]
["2018-02-28","Zmiana A",575,164,214,28,"Luty",{"$f":"WEEKNUM(Tabela14[[#This Row],[Data]],2)","v":9},2018,"Luty"]
["2018-02-28","Zmiana A",2035613,31,81,28,"Luty",{"$f":"WEEKNUM(Tabela14[[#This Row],[Data]],2)","v":9},2018,"Luty"]
["2018-02-28","Zmiana A",2297015,124,174,28,"Luty",{"$f":"WEEKNUM(Tabela14[[#This Row],[Data]],2)","v":9},2018,"Luty"]
["2018-02-28","Zmiana A","717F",560,610,28,"Luty",{"$f":"WEEKNUM(Tabela14[[#This Row],[Data]],2)","v":9},2018,"Luty"]
["2018-02-28","Zmiana A",416,174,224,28,"Luty",{"$f":"WEEKNUM(Tabela14[[#This Row],[Data]],2)","v":9},2018,"Luty"]
["2018-02-28","Zmiana A",958,118,168,28,"Luty",{"$f":"WEEKNUM(Tabela14[[#This Row],[Data]],2)","v":9},2018,"Luty"]
["2018-02-28","Zmiana A","716F",448,498,28,"Luty",{"$f":"WEEKNUM(Tabela14[[#This Row],[Data]],2)","v":9},2018,"Luty"]
["2018-02-28","Zmiana A",2001723,74,124,28,"Luty",{"$f":"WEEKNUM(Tabela14[[#This Row],[Data]],2)","v":9},2018,"Luty"]
["2018-02-28","Zmiana A",25,153,203,28,"Luty",{"$f":"WEEKNUM(Tabela14[[#This Row],[Data]],2)","v":9},2018,"Luty"]
["2018-02-28","Zmiana A",871,104,154,28,"Luty",{"$f":"WEEKNUM(Tabela14[[#This Row],[Data]],2)","v":9},2018,"Luty"]
["2018-02-28","Zmiana A",469,223,273,28,"Luty",{"$f":"WEEKNUM(Tabela14[[#This Row],[Data]],2)","v":9},2018,"Luty"]
["2018-02-28","Zmiana A",326,2614,2664,28,"Luty",{"$f":"WEEKNUM(Tabela14[[#This Row],[Data]],2)","v":9},2018,"Luty"]
["2018-02-28","Zmiana A",514,273,323,28,"Luty",{"$f":"WEEKNUM(Tabela14[[#This Row],[Data]],2)","v":9},2018,"Luty"]
["2018-02-28","Zmiana A",76,577,627,28,"Luty",{"$f":"WEEKNUM(Tabela14[[#This Row],[Data]],2)","v":9},2018,"Luty"]
["2018-02-28","Zmiana A",2408708,468,518,28,"Luty",{"$f":"WEEKNUM(Tabela14[[#This Row],[Data]],2)","v":9},2018,"Luty"]
["2018-02-28","Zmiana C",358,284,334,28,"Luty",{"$f":"WEEKNUM(Tabela14[[#This Row],[Data]],2)","v":9},2018,"Luty"]
["2018-02-28","Zmiana C",498,1744,1794,28,"Luty",{"$f":"WEEKNUM(Tabela14[[#This Row],[Data]],2)","v":9},2018,"Luty"]
["2018-02-28","Zmiana C",26144994,949,999,28,"Luty",{"$f":"WEEKNUM(Tabela14[[#This Row],[Data]],2)","v":9},2018,"Luty"]
["2018-02-28","Zmiana C",2296305,476,526,28,"Luty",{"$f":"WEEKNUM(Tabela14[[#This Row],[Data]],2)","v":9},2018,"Luty"]
["2018-02-28","Zmiana C",437,515,565,28,"Luty",{"$f":"WEEKNUM(Tabela14[[#This Row],[Data]],2)","v":9},2018,"Luty"]
["2018-03-01","Zmiana A","33501F",251,301,1,"Marzec",{"$f":"WEEKNUM(Tabela14[[#This Row],[Data]],2)","v":9},2018,"Marzec"]
["2018-03-01","Zmiana A","33503F",665,715,1,"Marzec",{"$f":"WEEKNUM(Tabela14[[#This Row],[Data]],2)","v":9},2018,"Marzec"]
["2018-03-01","Zmiana A",761,75,125,1,"Marzec",{"$f":"WEEKNUM(Tabela14[[#This Row],[Data]],2)","v":9},2018,"Marzec"]
["2018-03-01","Zmiana A",415,31,81,1,"Marzec",{"$f":"WEEKNUM(Tabela14[[#This Row],[Data]],2)","v":9},2018,"Marzec"]
["2018-03-01","Zmiana A",694,214,264,1,"Marzec",{"$f":"WEEKNUM(Tabela14[[#This Row],[Data]],2)","v":9},2018,"Marzec"]
["2018-03-01","Zmiana A",593,37,87,1,"Marzec",{"$f":"WEEKNUM(Tabela14[[#This Row],[Data]],2)","v":9},2018,"Marzec"]
["2018-03-01","Zmiana A",871,55,105,1,"Marzec",{"$f":"WEEKNUM(Tabela14[[#This Row],[Data]],2)","v":9},2018,"Marzec"]
["2018-03-01","Zmiana A",570,241,291,1,"Marzec",{"$f":"WEEKNUM(Tabela14[[#This Row],[Data]],2)","v":9},2018,"Marzec"]
["2018-03-01","Zmiana A","716F",7,57,1,"Marzec",{"$f":"WEEKNUM(Tabela14[[#This Row],[Data]],2)","v":9},2018,"Marzec"]
["2018-03-01","Zmiana A","334F",707,757,1,"Marzec",{"$f":"WEEKNUM(Tabela14[[#This Row],[Data]],2)","v":9},2018,"Marzec"]
["2018-03-01","Zmiana A",498,2778,2828,1,"Marzec",{"$f":"WEEKNUM(Tabela14[[#This Row],[Data]],2)","v":9},2018,"Marzec"]
["2018-03-01","Zmiana A",2149709,246,296,1,"Marzec",{"$f":"WEEKNUM(Tabela14[[#This Row],[Data]],2)","v":9},2018,"Marzec"]
["2018-03-01","Zmiana B",844,210,260,1,"Marzec",{"$f":"WEEKNUM(Tabela14[[#This Row],[Data]],2)","v":9},2018,"Marzec"]
["2018-03-01","Zmiana B",616,164,214,1,"Marzec",{"$f":"WEEKNUM(Tabela14[[#This Row],[Data]],2)","v":9},2018,"Marzec"]
["2018-03-01","Zmiana B",617,245,295,1,"Marzec",{"$f":"WEEKNUM(Tabela14[[#This Row],[Data]],2)","v":9},2018,"Marzec"]
["2018-03-01","Zmiana B",198,259,309,1,"Marzec",{"$f":"WEEKNUM(Tabela14[[#This Row],[Data]],2)","v":9},2018,"Marzec"]
["2018-03-01","Zmiana B",894,313,363,1,"Marzec",{"$f":"WEEKNUM(Tabela14[[#This Row],[Data]],2)","v":9},2018,"Marzec"]
["2018-03-01","Zmiana B","300F",1,51,1,"Marzec",{"$f":"WEEKNUM(Tabela14[[#This Row],[Data]],2)","v":9},2018,"Marzec"]
["2018-03-01","Zmiana B",812,526,576,1,"Marzec",{"$f":"WEEKNUM(Tabela14[[#This Row],[Data]],2)","v":9},2018,"Marzec"]
["2018-03-01","Zmiana A",839,227,277,1,"Marzec",{"$f":"WEEKNUM(Tabela14[[#This Row],[Data]],2)","v":9},2018,"Marzec"]
["2018-03-01","Zmiana A",560,247,297,1,"Marzec",{"$f":"WEEKNUM(Tabela14[[#This Row],[Data]],2)","v":9},2018,"Marzec"]
["2018-03-01","Zmiana A",575,124,174,1,"Marzec",{"$f":"WEEKNUM(Tabela14[[#This Row],[Data]],2)","v":9},2018,"Marzec"]
["2018-03-01","Zmiana A",2035613,303,353,1,"Marzec",{"$f":"WEEKNUM(Tabela14[[#This Row],[Data]],2)","v":9},2018,"Marzec"]
["2018-03-01","Zmiana A",2297015,70,120,{"$f":"IF(A1090=\"\",\"\",DAY(A1090))","v":1},{"$f":"IFERROR(VLOOKUP(IF(A1090=\"\",\"\",MONTH(A1090)),$P$3:$Q$14,2,FALSE),\"\")","v":"Marzec"},{"$f":"WEEKNUM(Tabela14[[#This Row],[Data]],2)","v":9},{"$f":"IF(A1090=\"\",\"\",YEAR(A1090))","v":2018},{"$f":"G1090","v":"Marzec"}]
["2018-03-01","Zmiana A","717F",599,649,1,"Marzec",{"$f":"WEEKNUM(Tabela14[[#This Row],[Data]],2)","v":9},2018,"Marzec"]
["2018-03-01","Zmiana A",416,3,53,1,"Marzec",{"$f":"WEEKNUM(Tabela14[[#This Row],[Data]],2)","v":9},2018,"Marzec"]
["2018-03-01","Zmiana A",958,54,104,1,"Marzec",{"$f":"WEEKNUM(Tabela14[[#This Row],[Data]],2)","v":9},2018,"Marzec"]
["2018-03-01","Zmiana A","716F",497,547,1,"Marzec",{"$f":"WEEKNUM(Tabela14[[#This Row],[Data]],2)","v":9},2018,"Marzec"]
["2018-03-01","Zmiana A",2001723,270,320,1,"Marzec",{"$f":"WEEKNUM(Tabela14[[#This Row],[Data]],2)","v":9},2018,"Marzec"]
["2018-03-01","Zmiana A",25,221,271,1,"Marzec",{"$f":"WEEKNUM(Tabela14[[#This Row],[Data]],2)","v":9},2018,"Marzec"]
["2018-03-01","Zmiana A",871,63,113,1,"Marzec",{"$f":"WEEKNUM(Tabela14[[#This Row],[Data]],2)","v":9},2018,"Marzec"]
["2018-03-01","Zmiana A",469,117,167,1,"Marzec",{"$f":"WEEKNUM(Tabela14[[#This Row],[Data]],2)","v":9},2018,"Marzec"]
["2018-03-01","Zmiana A",326,2871,2921,1,"Marzec",{"$f":"WEEKNUM(Tabela14[[#This Row],[Data]],2)","v":9},2018,"Marzec"]
["2018-03-01","Zmiana A",514,335,385,1,"Marzec",{"$f":"WEEKNUM(Tabela14[[#This Row],[Data]],2)","v":9},2018,"Marzec"]
["2018-03-01","Zmiana A",76,556,606,1,"Marzec",{"$f":"WEEKNUM(Tabela14[[#This Row],[Data]],2)","v":9},2018,"Marzec"]
["2018-03-01","Zmiana A",2408708,576,626,1,"Marzec",{"$f":"WEEKNUM(Tabela14[[#This Row],[Data]],2)","v":9},2018,"Marzec"]
["2018-03-01","Zmiana C",269,70,120,1,"Marzec",{"$f":"WEEKNUM(Tabela14[[#This Row],[Data]],2)","v":9},2018,"Marzec"]
["2018-03-01","Zmiana C",560,563,613,1,"Marzec",{"$f":"WEEKNUM(Tabela14[[#This Row],[Data]],2)","v":9},2018,"Marzec"]
["2018-03-01","Zmiana C",498,2444,2494,1,"Marzec",{"$f":"WEEKNUM(Tabela14[[#This Row],[Data]],2)","v":9},2018,"Marzec"]
["2018-03-01","Zmiana C",812,850,900,1,"Marzec",{"$f":"WEEKNUM(Tabela14[[#This Row],[Data]],2)","v":9},2018,"Marzec"]
["2018-03-02","Zmiana A",2030723,360,410,2,"Marzec",{"$f":"WEEKNUM(Tabela14[[#This Row],[Data]],2)","v":9},2018,"Marzec"]
["2018-03-02","Zmiana A",37,174,224,2,"Marzec",{"$f":"WEEKNUM(Tabela14[[#This Row],[Data]],2)","v":9},2018,"Marzec"]
["2018-03-02","Zmiana A",2149709,335,385,2,"Marzec",{"$f":"WEEKNUM(Tabela14[[#This Row],[Data]],2)","v":9},2018,"Marzec"]
["2018-03-02","Zmiana A",593,56,106,2,"Marzec",{"$f":"WEEKNUM(Tabela14[[#This Row],[Data]],2)","v":9},2018,"Marzec"]
["2018-03-02","Zmiana A",634,522,572,2,"Marzec",{"$f":"WEEKNUM(Tabela14[[#This Row],[Data]],2)","v":9},2018,"Marzec"]
["2018-03-02","Zmiana A",498,2361,2411,2,"Marzec",{"$f":"WEEKNUM(Tabela14[[#This Row],[Data]],2)","v":9},2018,"Marzec"]
["2018-03-02","Zmiana A",76,467,517,2,"Marzec",{"$f":"WEEKNUM(Tabela14[[#This Row],[Data]],2)","v":9},2018,"Marzec"]
["2018-03-02","Zmiana A",119,489,539,2,"Marzec",{"$f":"WEEKNUM(Tabela14[[#This Row],[Data]],2)","v":9},2018,"Marzec"]
["2018-03-02","Zmiana A",2001723,77,127,2,"Marzec",{"$f":"WEEKNUM(Tabela14[[#This Row],[Data]],2)","v":9},2018,"Marzec"]
["2018-03-02","Zmiana A",701,253,303,2,"Marzec",{"$f":"WEEKNUM(Tabela14[[#This Row],[Data]],2)","v":9},2018,"Marzec"]
["2018-03-02","Zmiana A",702,134,184,2,"Marzec",{"$f":"WEEKNUM(Tabela14[[#This Row],[Data]],2)","v":9},2018,"Marzec"]
["2018-03-02","Zmiana A",289,281,331,2,"Marzec",{"$f":"WEEKNUM(Tabela14[[#This Row],[Data]],2)","v":9},2018,"Marzec"]
["2018-03-02","Zmiana B",2149709,265,315,2,"Marzec",{"$f":"WEEKNUM(Tabela14[[#This Row],[Data]],2)","v":9},2018,"Marzec"]
["2018-03-02","Zmiana B",2219049,64,114,2,"Marzec",{"$f":"WEEKNUM(Tabela14[[#This Row],[Data]],2)","v":9},2018,"Marzec"]
["2018-03-02","Zmiana B",514,244,294,2,"Marzec",{"$f":"WEEKNUM(Tabela14[[#This Row],[Data]],2)","v":9},2018,"Marzec"]
["2018-03-02","Zmiana B",2418976,408,458,2,"Marzec",{"$f":"WEEKNUM(Tabela14[[#This Row],[Data]],2)","v":9},2018,"Marzec"]
["2018-03-02","Zmiana B",2418977,527,577,2,"Marzec",{"$f":"WEEKNUM(Tabela14[[#This Row],[Data]],2)","v":9},2018,"Marzec"]
["2018-03-02","Zmiana B",933,708,758,2,"Marzec",{"$f":"WEEKNUM(Tabela14[[#This Row],[Data]],2)","v":9},2018,"Marzec"]
["2018-03-02","Zmiana B",498,2422,2472,2,"Marzec",{"$f":"WEEKNUM(Tabela14[[#This Row],[Data]],2)","v":9},2018,"Marzec"]
["2018-03-02","Zmiana B",791,370,420,2,"Marzec",{"$f":"WEEKNUM(Tabela14[[#This Row],[Data]],2)","v":9},2018,"Marzec"]
["2018-03-03","Zmiana A","s122309",444,494,3,"Marzec",{"$f":"WEEKNUM(Tabela14[[#This Row],[Data]],2)","v":9},2018,"Marzec"]
["2018-03-03","Zmiana A",119,950,1000,3,"Marzec",{"$f":"WEEKNUM(Tabela14[[#This Row],[Data]],2)","v":9},2018,"Marzec"]
["2018-03-03","Zmiana A",76,1057,1107,3,"Marzec",{"$f":"WEEKNUM(Tabela14[[#This Row],[Data]],2)","v":9},2018,"Marzec"]
["2018-03-05","Zmiana A","718F",21,71,5,"Marzec",{"$f":"WEEKNUM(Tabela14[[#This Row],[Data]],2)","v":10},2018,"Marzec"]
["2018-03-05","Zmiana A","33501F",529,579,5,"Marzec",{"$f":"WEEKNUM(Tabela14[[#This Row],[Data]],2)","v":10},2018,"Marzec"]
["2018-03-05","Zmiana A",2296305,281,331,5,"Marzec",{"$f":"WEEKNUM(Tabela14[[#This Row],[Data]],2)","v":10},2018,"Marzec"]
["2018-03-05","Zmiana A",414,96,146,5,"Marzec",{"$f":"WEEKNUM(Tabela14[[#This Row],[Data]],2)","v":10},2018,"Marzec"]
["2018-03-05","Zmiana A",418,276,326,5,"Marzec",{"$f":"WEEKNUM(Tabela14[[#This Row],[Data]],2)","v":10},2018,"Marzec"]
["2018-03-05","Zmiana A",415,156,206,5,"Marzec",{"$f":"WEEKNUM(Tabela14[[#This Row],[Data]],2)","v":10},2018,"Marzec"]
["2018-03-05","Zmiana A",498,2087,2137,5,"Marzec",{"$f":"WEEKNUM(Tabela14[[#This Row],[Data]],2)","v":10},2018,"Marzec"]
["2018-03-05","Zmiana A",26144994,1507,1557,5,"Marzec",{"$f":"WEEKNUM(Tabela14[[#This Row],[Data]],2)","v":10},2018,"Marzec"]
["2018-03-05","Zmiana A",48,73,123,5,"Marzec",{"$f":"WEEKNUM(Tabela14[[#This Row],[Data]],2)","v":10},2018,"Marzec"]
["2018-03-05","Zmiana A",122,404,454,5,"Marzec",{"$f":"WEEKNUM(Tabela14[[#This Row],[Data]],2)","v":10},2018,"Marzec"]
["2018-03-05","Zmiana A",319,51,101,5,"Marzec",{"$f":"WEEKNUM(Tabela14[[#This Row],[Data]],2)","v":10},2018,"Marzec"]
["2018-03-05","Zmiana A",391,54,104,5,"Marzec",{"$f":"WEEKNUM(Tabela14[[#This Row],[Data]],2)","v":10},2018,"Marzec"]
["2018-03-05","Zmiana A",2067417,190,240,5,"Marzec",{"$f":"WEEKNUM(Tabela14[[#This Row],[Data]],2)","v":10},2018,"Marzec"]
["2018-03-05","Zmiana A",416,34,84,5,"Marzec",{"$f":"WEEKNUM(Tabela14[[#This Row],[Data]],2)","v":10},2018,"Marzec"]
["2018-03-05","Zmiana A",554,121,171,5,"Marzec",{"$f":"WEEKNUM(Tabela14[[#This Row],[Data]],2)","v":10},2018,"Marzec"]
["2018-03-05","Zmiana A",958,287,337,5,"Marzec",{"$f":"WEEKNUM(Tabela14[[#This Row],[Data]],2)","v":10},2018,"Marzec"]
["2018-03-05","Zmiana A","717F",688,738,5,"Marzec",{"$f":"WEEKNUM(Tabela14[[#This Row],[Data]],2)","v":10},2018,"Marzec"]
["2018-03-05","Zmiana A",2297015,229,279,5,"Marzec",{"$f":"WEEKNUM(Tabela14[[#This Row],[Data]],2)","v":10},2018,"Marzec"]
["2018-03-05","Zmiana A",2432300,515,565,5,"Marzec",{"$f":"WEEKNUM(Tabela14[[#This Row],[Data]],2)","v":10},2018,"Marzec"]
["2018-03-05","Zmiana A",701,243,293,5,"Marzec",{"$f":"WEEKNUM(Tabela14[[#This Row],[Data]],2)","v":10},2018,"Marzec"]
["2018-03-03","Zmiana B",1745895,188,238,3,"Marzec",{"$f":"WEEKNUM(Tabela14[[#This Row],[Data]],2)","v":9},2018,"Marzec"]
["2018-03-03","Zmiana B",896,52,102,3,"Marzec",{"$f":"WEEKNUM(Tabela14[[#This Row],[Data]],2)","v":9},2018,"Marzec"]
["2018-03-03","Zmiana B",198,362,412,3,"Marzec",{"$f":"WEEKNUM(Tabela14[[#This Row],[Data]],2)","v":9},2018,"Marzec"]
["2018-03-03","Zmiana B",2632895,108,158,3,"Marzec",{"$f":"WEEKNUM(Tabela14[[#This Row],[Data]],2)","v":9},2018,"Marzec"]
["2018-03-03","Zmiana B",570,385,435,{"$f":"IF(A1154=\"\",\"\",DAY(A1154))","v":3},{"$f":"IFERROR(VLOOKUP(IF(A1154=\"\",\"\",MONTH(A1154)),$P$3:$Q$14,2,FALSE),\"\")","v":"Marzec"},{"$f":"WEEKNUM(Tabela14[[#This Row],[Data]],2)","v":9},{"$f":"IF(A1154=\"\",\"\",YEAR(A1154))","v":2018},{"$f":"G1154","v":"Marzec"}]
["2018-03-03","Zmiana B",179,1467,1517,3,"Marzec",{"$f":"WEEKNUM(Tabela14[[#This Row],[Data]],2)","v":9},2018,"Marzec"]
["2018-03-03","Zmiana B",2408708,554,604,3,"Marzec",{"$f":"WEEKNUM(Tabela14[[#This Row],[Data]],2)","v":9},2018,"Marzec"]
["2018-03-05","Zmiana C",326,2497,2547,5,"Marzec",{"$f":"WEEKNUM(Tabela14[[#This Row],[Data]],2)","v":10},2018,"Marzec"]
["2018-03-05","Zmiana C",212,86,136,5,"Marzec",{"$f":"WEEKNUM(Tabela14[[#This Row],[Data]],2)","v":10},2018,"Marzec"]
["2018-03-05","Zmiana C",214,247,297,5,"Marzec",{"$f":"WEEKNUM(Tabela14[[#This Row],[Data]],2)","v":10},2018,"Marzec"]
["2018-03-05","Zmiana C",310,240,290,5,"Marzec",{"$f":"WEEKNUM(Tabela14[[#This Row],[Data]],2)","v":10},2018,"Marzec"]
["2018-03-05","Zmiana C",192,124,174,5,"Marzec",{"$f":"WEEKNUM(Tabela14[[#This Row],[Data]],2)","v":10},2018,"Marzec"]
["2018-03-06","Zmiana B",958,195,245,6,"Marzec",{"$f":"WEEKNUM(Tabela14[[#This Row],[Data]],2)","v":10},2018,"Marzec"]
["2018-03-06","Zmiana B",544,39,89,6,"Marzec",{"$f":"WEEKNUM(Tabela14[[#This Row],[Data]],2)","v":10},2018,"Marzec"]
["2018-03-06","Zmiana B","334F",1113,1163,6,"Marzec",{"$f":"WEEKNUM(Tabela14[[#This Row],[Data]],2)","v":10},2018,"Marzec"]
["2018-03-06","Zmiana B",966,36,86,6,"Marzec",{"$f":"WEEKNUM(Tabela14[[#This Row],[Data]],2)","v":10},2018,"Marzec"]
["2018-03-06","Zmiana B",414,109,159,6,"Marzec",{"$f":"WEEKNUM(Tabela14[[#This Row],[Data]],2)","v":10},2018,"Marzec"]
["2018-03-06","Zmiana B",2297015,268,318,6,"Marzec",{"$f":"WEEKNUM(Tabela14[[#This Row],[Data]],2)","v":10},2018,"Marzec"]
["2018-03-06","Zmiana B",1901726,176,226,6,"Marzec",{"$f":"WEEKNUM(Tabela14[[#This Row],[Data]],2)","v":10},2018,"Marzec"]
["2018-03-06","Zmiana B",437,476,526,6,"Marzec",{"$f":"WEEKNUM(Tabela14[[#This Row],[Data]],2)","v":10},2018,"Marzec"]
["2018-03-06","Zmiana B",780,42,92,6,"Marzec",{"$f":"WEEKNUM(Tabela14[[#This Row],[Data]],2)","v":10},2018,"Marzec"]
["2018-03-06","Zmiana B",97,44,94,6,"Marzec",{"$f":"WEEKNUM(Tabela14[[#This Row],[Data]],2)","v":10},2018,"Marzec"]
["2018-03-06","Zmiana B",326,2431,2481,6,"Marzec",{"$f":"WEEKNUM(Tabela14[[#This Row],[Data]],2)","v":10},2018,"Marzec"]
["2018-03-06","Zmiana B",2451635,358,408,6,"Marzec",{"$f":"WEEKNUM(Tabela14[[#This Row],[Data]],2)","v":10},2018,"Marzec"]
["2018-03-06","Zmiana B",812,481,531,6,"Marzec",{"$f":"WEEKNUM(Tabela14[[#This Row],[Data]],2)","v":10},2018,"Marzec"]
["2018-03-06","Zmiana B",2126381,24,74,6,"Marzec",{"$f":"WEEKNUM(Tabela14[[#This Row],[Data]],2)","v":10},2018,"Marzec"]
["2018-03-06","Zmiana B",198,293,343,6,"Marzec",{"$f":"WEEKNUM(Tabela14[[#This Row],[Data]],2)","v":10},2018,"Marzec"]
["2018-03-06","Zmiana B",2451636,626,676,6,"Marzec",{"$f":"WEEKNUM(Tabela14[[#This Row],[Data]],2)","v":10},2018,"Marzec"]
["2018-03-06","Zmiana B",414,127,177,6,"Marzec",{"$f":"WEEKNUM(Tabela14[[#This Row],[Data]],2)","v":10},2018,"Marzec"]
["2018-03-06","Zmiana B",575,533,583,6,"Marzec",{"$f":"WEEKNUM(Tabela14[[#This Row],[Data]],2)","v":10},2018,"Marzec"]
["2018-03-06","Zmiana B",2451635,552,602,6,"Marzec",{"$f":"WEEKNUM(Tabela14[[#This Row],[Data]],2)","v":10},2018,"Marzec"]
["2018-03-07","Zmiana A","708F",281,331,7,"Marzec",{"$f":"WEEKNUM(Tabela14[[#This Row],[Data]],2)","v":10},2018,"Marzec"]
["2018-03-07","Zmiana A",26144994,820,870,7,"Marzec",{"$f":"WEEKNUM(Tabela14[[#This Row],[Data]],2)","v":10},2018,"Marzec"]
["2018-03-07","Zmiana A",498,2403,2453,7,"Marzec",{"$f":"WEEKNUM(Tabela14[[#This Row],[Data]],2)","v":10},2018,"Marzec"]
["2018-03-07","Zmiana A","800-569488-F",20,70,7,"Marzec",{"$f":"WEEKNUM(Tabela14[[#This Row],[Data]],2)","v":10},2018,"Marzec"]
["2018-03-07","Zmiana A","800-569638-F",39,89,7,"Marzec",{"$f":"WEEKNUM(Tabela14[[#This Row],[Data]],2)","v":10},2018,"Marzec"]
["2018-03-07","Zmiana A","500F",243,293,7,"Marzec",{"$f":"WEEKNUM(Tabela14[[#This Row],[Data]],2)","v":10},2018,"Marzec"]
["2018-03-07","Zmiana A",179,209,259,7,"Marzec",{"$f":"WEEKNUM(Tabela14[[#This Row],[Data]],2)","v":10},2018,"Marzec"]
["2018-03-07","Zmiana A","33505F",163,213,7,"Marzec",{"$f":"WEEKNUM(Tabela14[[#This Row],[Data]],2)","v":10},2018,"Marzec"]
["2018-03-07","Zmiana A",2113026,128,178,7,"Marzec",{"$f":"WEEKNUM(Tabela14[[#This Row],[Data]],2)","v":10},2018,"Marzec"]
["2018-03-07","Zmiana A",289,47,97,7,"Marzec",{"$f":"WEEKNUM(Tabela14[[#This Row],[Data]],2)","v":10},2018,"Marzec"]
["2018-03-07","Zmiana A",2451635,280,330,7,"Marzec",{"$f":"WEEKNUM(Tabela14[[#This Row],[Data]],2)","v":10},2018,"Marzec"]
["2018-03-07","Zmiana A","33503F",392,442,7,"Marzec",{"$f":"WEEKNUM(Tabela14[[#This Row],[Data]],2)","v":10},2018,"Marzec"]
["2018-03-07","Zmiana A",888,250,300,7,"Marzec",{"$f":"WEEKNUM(Tabela14[[#This Row],[Data]],2)","v":10},2018,"Marzec"]
["2018-03-07","Zmiana A",812,806,856,7,"Marzec",{"$f":"WEEKNUM(Tabela14[[#This Row],[Data]],2)","v":10},2018,"Marzec"]
["2018-03-07","Zmiana A",202,117,167,7,"Marzec",{"$f":"WEEKNUM(Tabela14[[#This Row],[Data]],2)","v":10},2018,"Marzec"]
["2018-03-07","Zmiana A",780,121,171,7,"Marzec",{"$f":"WEEKNUM(Tabela14[[#This Row],[Data]],2)","v":10},2018,"Marzec"]
["2018-03-07","Zmiana A",162,157,207,7,"Marzec",{"$f":"WEEKNUM(Tabela14[[#This Row],[Data]],2)","v":10},2018,"Marzec"]
["2018-03-07","Zmiana B",693,184,234,7,"Marzec",{"$f":"WEEKNUM(Tabela14[[#This Row],[Data]],2)","v":10},2018,"Marzec"]
["2018-03-07","Zmiana B",2149709,246,296,7,"Marzec",{"$f":"WEEKNUM(Tabela14[[#This Row],[Data]],2)","v":10},2018,"Marzec"]
["2018-03-07","Zmiana B",198,286,336,7,"Marzec",{"$f":"WEEKNUM(Tabela14[[#This Row],[Data]],2)","v":10},2018,"Marzec"]
["2018-03-07","Zmiana B",746,171,221,7,"Marzec",{"$f":"WEEKNUM(Tabela14[[#This Row],[Data]],2)","v":10},2018,"Marzec"]
["2018-03-07","Zmiana B",844,235,285,7,"Marzec",{"$f":"WEEKNUM(Tabela14[[#This Row],[Data]],2)","v":10},2018,"Marzec"]
["2018-03-07","Zmiana B",2296305,537,587,7,"Marzec",{"$f":"WEEKNUM(Tabela14[[#This Row],[Data]],2)","v":10},2018,"Marzec"]
["2018-03-07","Zmiana B",543,332,382,7,"Marzec",{"$f":"WEEKNUM(Tabela14[[#This Row],[Data]],2)","v":10},2018,"Marzec"]
["2018-03-07","Zmiana B",2297015,454,504,7,"Marzec",{"$f":"WEEKNUM(Tabela14[[#This Row],[Data]],2)","v":10},2018,"Marzec"]
["2018-03-07","Zmiana C",26144994,358,408,7,"Marzec",{"$f":"WEEKNUM(Tabela14[[#This Row],[Data]],2)","v":10},2018,"Marzec"]
["2018-03-07","Zmiana C",326,2248,2298,7,"Marzec",{"$f":"WEEKNUM(Tabela14[[#This Row],[Data]],2)","v":10},2018,"Marzec"]
["2018-03-08","Zmiana A","721F",523,573,8,"Marzec",{"$f":"WEEKNUM(Tabela14[[#This Row],[Data]],2)","v":10},2018,"Marzec"]
["2018-03-08","Zmiana A",2149709,307,357,8,"Marzec",{"$f":"WEEKNUM(Tabela14[[#This Row],[Data]],2)","v":10},2018,"Marzec"]
["2018-03-08","Zmiana A",780,170,220,8,"Marzec",{"$f":"WEEKNUM(Tabela14[[#This Row],[Data]],2)","v":10},2018,"Marzec"]
["2018-03-08","Zmiana A",2113026,194,244,8,"Marzec",{"$f":"WEEKNUM(Tabela14[[#This Row],[Data]],2)","v":10},2018,"Marzec"]
["2018-03-08","Zmiana A",761,44,94,8,"Marzec",{"$f":"WEEKNUM(Tabela14[[#This Row],[Data]],2)","v":10},2018,"Marzec"]
["2018-03-08","Zmiana A","717F",627,677,8,"Marzec",{"$f":"WEEKNUM(Tabela14[[#This Row],[Data]],2)","v":10},2018,"Marzec"]
["2018-03-08","Zmiana A",2001723,113,163,8,"Marzec",{"$f":"WEEKNUM(Tabela14[[#This Row],[Data]],2)","v":10},2018,"Marzec"]
["2018-03-08","Zmiana A",326,2475,2525,8,"Marzec",{"$f":"WEEKNUM(Tabela14[[#This Row],[Data]],2)","v":10},2018,"Marzec"]
["2018-03-08","Zmiana A",26144994,235,285,8,"Marzec",{"$f":"WEEKNUM(Tabela14[[#This Row],[Data]],2)","v":10},2018,"Marzec"]
["2018-03-08","Zmiana A",812,334,384,8,"Marzec",{"$f":"WEEKNUM(Tabela14[[#This Row],[Data]],2)","v":10},2018,"Marzec"]
["2018-03-08","Zmiana A",2237976,54,104,{"$f":"IF(A1218=\"\",\"\",DAY(A1218))","v":8},{"$f":"IFERROR(VLOOKUP(IF(A1218=\"\",\"\",MONTH(A1218)),$P$3:$Q$14,2,FALSE),\"\")","v":"Marzec"},{"$f":"WEEKNUM(Tabela14[[#This Row],[Data]],2)","v":10},{"$f":"IF(A1218=\"\",\"\",YEAR(A1218))","v":2018},{"$f":"G1218","v":"Marzec"}]
["2018-03-08","Zmiana A",341,33,83,8,"Marzec",{"$f":"WEEKNUM(Tabela14[[#This Row],[Data]],2)","v":10},2018,"Marzec"]
["2018-03-08","Zmiana B",843,169,219,8,"Marzec",{"$f":"WEEKNUM(Tabela14[[#This Row],[Data]],2)","v":10},2018,"Marzec"]
["2018-03-08","Zmiana B",307,136,186,8,"Marzec",{"$f":"WEEKNUM(Tabela14[[#This Row],[Data]],2)","v":10},2018,"Marzec"]
["2018-03-08","Zmiana B",162,264,314,8,"Marzec",{"$f":"WEEKNUM(Tabela14[[#This Row],[Data]],2)","v":10},2018,"Marzec"]
["2018-03-08","Zmiana B",2007977,97,147,8,"Marzec",{"$f":"WEEKNUM(Tabela14[[#This Row],[Data]],2)","v":10},2018,"Marzec"]
["2018-03-08","Zmiana B",701,184,234,8,"Marzec",{"$f":"WEEKNUM(Tabela14[[#This Row],[Data]],2)","v":10},2018,"Marzec"]
["2018-03-08","Zmiana B",787,567,617,8,"Marzec",{"$f":"WEEKNUM(Tabela14[[#This Row],[Data]],2)","v":10},2018,"Marzec"]
["2018-03-08","Zmiana B",252,336,386,8,"Marzec",{"$f":"WEEKNUM(Tabela14[[#This Row],[Data]],2)","v":10},2018,"Marzec"]
["2018-03-08","Zmiana B",76,478,528,8,"Marzec",{"$f":"WEEKNUM(Tabela14[[#This Row],[Data]],2)","v":10},2018,"Marzec"]
["2018-03-08","Zmiana B",570,678,728,8,"Marzec",{"$f":"WEEKNUM(Tabela14[[#This Row],[Data]],2)","v":10},2018,"Marzec"]
["2018-03-08","Zmiana B",431,308,358,8,"Marzec",{"$f":"WEEKNUM(Tabela14[[#This Row],[Data]],2)","v":10},2018,"Marzec"]
["2018-03-08","Zmiana C",326,2624,2674,8,"Marzec",{"$f":"WEEKNUM(Tabela14[[#This Row],[Data]],2)","v":10},2018,"Marzec"]
["2018-03-09","Zmiana A",326,649,699,9,"Marzec",{"$f":"WEEKNUM(Tabela14[[#This Row],[Data]],2)","v":10},2018,"Marzec"]
["2018-03-09","Zmiana A",498,1705,1755,9,"Marzec",{"$f":"WEEKNUM(Tabela14[[#This Row],[Data]],2)","v":10},2018,"Marzec"]
["2018-03-09","Zmiana A",996,585,635,9,"Marzec",{"$f":"WEEKNUM(Tabela14[[#This Row],[Data]],2)","v":10},2018,"Marzec"]
["2018-03-09","Zmiana A",162,146,196,9,"Marzec",{"$f":"WEEKNUM(Tabela14[[#This Row],[Data]],2)","v":10},2018,"Marzec"]
["2018-03-09","Zmiana A",416,157,207,9,"Marzec",{"$f":"WEEKNUM(Tabela14[[#This Row],[Data]],2)","v":10},2018,"Marzec"]
["2018-03-09","Zmiana A",415,202,252,9,"Marzec",{"$f":"WEEKNUM(Tabela14[[#This Row],[Data]],2)","v":10},2018,"Marzec"]
["2018-03-09","Zmiana A",554,11,61,9,"Marzec",{"$f":"WEEKNUM(Tabela14[[#This Row],[Data]],2)","v":10},2018,"Marzec"]
["2018-03-09","Zmiana A",560,280,330,9,"Marzec",{"$f":"WEEKNUM(Tabela14[[#This Row],[Data]],2)","v":10},2018,"Marzec"]
["2018-03-09","Zmiana A",289,137,187,9,"Marzec",{"$f":"WEEKNUM(Tabela14[[#This Row],[Data]],2)","v":10},2018,"Marzec"]
["2018-03-09","Zmiana A",701,144,194,9,"Marzec",{"$f":"WEEKNUM(Tabela14[[#This Row],[Data]],2)","v":10},2018,"Marzec"]
["2018-03-09","Zmiana A",69,181,231,9,"Marzec",{"$f":"WEEKNUM(Tabela14[[#This Row],[Data]],2)","v":10},2018,"Marzec"]
["2018-03-09","Zmiana A",547,1,51,9,"Marzec",{"$f":"WEEKNUM(Tabela14[[#This Row],[Data]],2)","v":10},2018,"Marzec"]
["2018-03-09","Zmiana A",37,135,185,9,"Marzec",{"$f":"WEEKNUM(Tabela14[[#This Row],[Data]],2)","v":10},2018,"Marzec"]
["2018-03-09","Zmiana A","708F",595,645,9,"Marzec",{"$f":"WEEKNUM(Tabela14[[#This Row],[Data]],2)","v":10},2018,"Marzec"]
["2018-03-09","Zmiana A",2310044,393,443,9,"Marzec",{"$f":"WEEKNUM(Tabela14[[#This Row],[Data]],2)","v":10},2018,"Marzec"]
["2018-03-09","Zmiana A",2432300,626,676,9,"Marzec",{"$f":"WEEKNUM(Tabela14[[#This Row],[Data]],2)","v":10},2018,"Marzec"]
["2018-03-09","Zmiana B",198,364,414,9,"Marzec",{"$f":"WEEKNUM(Tabela14[[#This Row],[Data]],2)","v":10},2018,"Marzec"]
["2018-03-09","Zmiana B",933,365,415,9,"Marzec",{"$f":"WEEKNUM(Tabela14[[#This Row],[Data]],2)","v":10},2018,"Marzec"]
["2018-03-09","Zmiana B","300F",286,336,9,"Marzec",{"$f":"WEEKNUM(Tabela14[[#This Row],[Data]],2)","v":10},2018,"Marzec"]
["2018-03-09","Zmiana B",894,227,277,9,"Marzec",{"$f":"WEEKNUM(Tabela14[[#This Row],[Data]],2)","v":10},2018,"Marzec"]
["2018-03-09","Zmiana B",571,671,721,9,"Marzec",{"$f":"WEEKNUM(Tabela14[[#This Row],[Data]],2)","v":10},2018,"Marzec"]
["2018-03-09","Zmiana B",767,226,276,9,"Marzec",{"$f":"WEEKNUM(Tabela14[[#This Row],[Data]],2)","v":10},2018,"Marzec"]
["2018-03-09","Zmiana B",797,62,112,9,"Marzec",{"$f":"WEEKNUM(Tabela14[[#This Row],[Data]],2)","v":10},2018,"Marzec"]
["2018-03-09","Zmiana B",97,360,410,9,"Marzec",{"$f":"WEEKNUM(Tabela14[[#This Row],[Data]],2)","v":10},2018,"Marzec"]
["2018-03-09","Zmiana C",498,2263,2313,9,"Marzec",{"$f":"WEEKNUM(Tabela14[[#This Row],[Data]],2)","v":10},2018,"Marzec"]
["2018-03-09","Zmiana C",326,100,150,9,"Marzec",{"$f":"WEEKNUM(Tabela14[[#This Row],[Data]],2)","v":10},2018,"Marzec"]
["2018-03-09","Zmiana C",1745895,210,260,9,"Marzec",{"$f":"WEEKNUM(Tabela14[[#This Row],[Data]],2)","v":10},2018,"Marzec"]
["2018-03-10","Zmiana A",1745895,304,354,10,"Marzec",{"$f":"WEEKNUM(Tabela14[[#This Row],[Data]],2)","v":10},2018,"Marzec"]
["2018-03-10","Zmiana A","334F",1379,1429,10,"Marzec",{"$f":"WEEKNUM(Tabela14[[#This Row],[Data]],2)","v":10},2018,"Marzec"]
["2018-03-10","Zmiana A",212,150,200,10,"Marzec",{"$f":"WEEKNUM(Tabela14[[#This Row],[Data]],2)","v":10},2018,"Marzec"]
["2018-03-10","Zmiana A",214,157,207,10,"Marzec",{"$f":"WEEKNUM(Tabela14[[#This Row],[Data]],2)","v":10},2018,"Marzec"]
["2018-03-10","Zmiana A",119,1289,1339,10,"Marzec",{"$f":"WEEKNUM(Tabela14[[#This Row],[Data]],2)","v":10},2018,"Marzec"]
["2018-03-10","Zmiana A","33503F",394,444,10,"Marzec",{"$f":"WEEKNUM(Tabela14[[#This Row],[Data]],2)","v":10},2018,"Marzec"]
["2018-03-12","Zmiana A",787,56,106,12,"Marzec",{"$f":"WEEKNUM(Tabela14[[#This Row],[Data]],2)","v":11},2018,"Marzec"]
["2018-03-12","Zmiana A",888,168,218,12,"Marzec",{"$f":"WEEKNUM(Tabela14[[#This Row],[Data]],2)","v":11},2018,"Marzec"]
["2018-03-12","Zmiana A","33503F",1439,1489,12,"Marzec",{"$f":"WEEKNUM(Tabela14[[#This Row],[Data]],2)","v":11},2018,"Marzec"]
["2018-03-12","Zmiana A",677,123,173,12,"Marzec",{"$f":"WEEKNUM(Tabela14[[#This Row],[Data]],2)","v":11},2018,"Marzec"]
["2018-03-12","Zmiana A",498,228,278,12,"Marzec",{"$f":"WEEKNUM(Tabela14[[#This Row],[Data]],2)","v":11},2018,"Marzec"]
["2018-03-12","Zmiana A",2067417,295,345,12,"Marzec",{"$f":"WEEKNUM(Tabela14[[#This Row],[Data]],2)","v":11},2018,"Marzec"]
["2018-03-12","Zmiana A",418,172,222,12,"Marzec",{"$f":"WEEKNUM(Tabela14[[#This Row],[Data]],2)","v":11},2018,"Marzec"]
["2018-03-12","Zmiana A",871,311,361,12,"Marzec",{"$f":"WEEKNUM(Tabela14[[#This Row],[Data]],2)","v":11},2018,"Marzec"]
["2018-03-12","Zmiana A",704,322,372,12,"Marzec",{"$f":"WEEKNUM(Tabela14[[#This Row],[Data]],2)","v":11},2018,"Marzec"]
["2018-03-12","Zmiana A",47,267,317,12,"Marzec",{"$f":"WEEKNUM(Tabela14[[#This Row],[Data]],2)","v":11},2018,"Marzec"]
["2018-03-12","Zmiana A",92,102,152,12,"Marzec",{"$f":"WEEKNUM(Tabela14[[#This Row],[Data]],2)","v":11},2018,"Marzec"]
["2018-03-12","Zmiana A",562,88,138,12,"Marzec",{"$f":"WEEKNUM(Tabela14[[#This Row],[Data]],2)","v":11},2018,"Marzec"]
["2018-03-12","Zmiana A",702,211,261,12,"Marzec",{"$f":"WEEKNUM(Tabela14[[#This Row],[Data]],2)","v":11},2018,"Marzec"]
["2018-03-12","Zmiana A",326,3111,3161,12,"Marzec",{"$f":"WEEKNUM(Tabela14[[#This Row],[Data]],2)","v":11},2018,"Marzec"]
["2018-03-12","Zmiana A",812,865,915,12,"Marzec",{"$f":"WEEKNUM(Tabela14[[#This Row],[Data]],2)","v":11},2018,"Marzec"]
["2018-03-12","Zmiana B",2219049,289,339,12,"Marzec",{"$f":"WEEKNUM(Tabela14[[#This Row],[Data]],2)","v":11},2018,"Marzec"]
["2018-03-12","Zmiana B",269,361,411,12,"Marzec",{"$f":"WEEKNUM(Tabela14[[#This Row],[Data]],2)","v":11},2018,"Marzec"]
["2018-03-12","Zmiana B",198,591,641,12,"Marzec",{"$f":"WEEKNUM(Tabela14[[#This Row],[Data]],2)","v":11},2018,"Marzec"]
["2018-03-12","Zmiana B",437,685,735,{"$f":"IF(A1282=\"\",\"\",DAY(A1282))","v":12},{"$f":"IFERROR(VLOOKUP(IF(A1282=\"\",\"\",MONTH(A1282)),$P$3:$Q$14,2,FALSE),\"\")","v":"Marzec"},{"$f":"WEEKNUM(Tabela14[[#This Row],[Data]],2)","v":11},{"$f":"IF(A1282=\"\",\"\",YEAR(A1282))","v":2018},{"$f":"G1282","v":"Marzec"}]
["2018-03-12","Zmiana B",966,230,280,12,"Marzec",{"$f":"WEEKNUM(Tabela14[[#This Row],[Data]],2)","v":11},2018,"Marzec"]
["2018-03-12","Zmiana B",498,2626,2676,12,"Marzec",{"$f":"WEEKNUM(Tabela14[[#This Row],[Data]],2)","v":11},2018,"Marzec"]
["2018-03-12","Zmiana B",560,369,419,12,"Marzec",{"$f":"WEEKNUM(Tabela14[[#This Row],[Data]],2)","v":11},2018,"Marzec"]
["2018-03-12","Zmiana B",634,352,402,12,"Marzec",{"$f":"WEEKNUM(Tabela14[[#This Row],[Data]],2)","v":11},2018,"Marzec"]
["2018-03-12","Zmiana B",69,350,400,12,"Marzec",{"$f":"WEEKNUM(Tabela14[[#This Row],[Data]],2)","v":11},2018,"Marzec"]
["2018-03-12","Zmiana C",498,2338,2388,12,"Marzec",{"$f":"WEEKNUM(Tabela14[[#This Row],[Data]],2)","v":11},2018,"Marzec"]
["2018-03-12","Zmiana C",839,325,375,12,"Marzec",{"$f":"WEEKNUM(Tabela14[[#This Row],[Data]],2)","v":11},2018,"Marzec"]
["2018-03-12","Zmiana C",103,158,208,12,"Marzec",{"$f":"WEEKNUM(Tabela14[[#This Row],[Data]],2)","v":11},2018,"Marzec"]
["2018-03-13","Zmiana A","33503F",202,252,13,"Marzec",{"$f":"WEEKNUM(Tabela14[[#This Row],[Data]],2)","v":11},2018,"Marzec"]
["2018-03-13","Zmiana A",812,535,585,13,"Marzec",{"$f":"WEEKNUM(Tabela14[[#This Row],[Data]],2)","v":11},2018,"Marzec"]
["2018-03-13","Zmiana A",2432300,63,113,13,"Marzec",{"$f":"WEEKNUM(Tabela14[[#This Row],[Data]],2)","v":11},2018,"Marzec"]
["2018-03-13","Zmiana A",570,53,103,13,"Marzec",{"$f":"WEEKNUM(Tabela14[[#This Row],[Data]],2)","v":11},2018,"Marzec"]
["2018-03-13","Zmiana A",571,65,115,13,"Marzec",{"$f":"WEEKNUM(Tabela14[[#This Row],[Data]],2)","v":11},2018,"Marzec"]
["2018-03-13","Zmiana A",97,75,125,13,"Marzec",{"$f":"WEEKNUM(Tabela14[[#This Row],[Data]],2)","v":11},2018,"Marzec"]
["2018-03-13","Zmiana A",761,119,169,13,"Marzec",{"$f":"WEEKNUM(Tabela14[[#This Row],[Data]],2)","v":11},2018,"Marzec"]
["2018-03-13","Zmiana A",498,2326,2376,13,"Marzec",{"$f":"WEEKNUM(Tabela14[[#This Row],[Data]],2)","v":11},2018,"Marzec"]
["2018-03-13","Zmiana A",119,55,105,13,"Marzec",{"$f":"WEEKNUM(Tabela14[[#This Row],[Data]],2)","v":11},2018,"Marzec"]
["2018-03-13","Zmiana A",502,153,203,13,"Marzec",{"$f":"WEEKNUM(Tabela14[[#This Row],[Data]],2)","v":11},2018,"Marzec"]
["2018-03-13","Zmiana A",310,117,167,13,"Marzec",{"$f":"WEEKNUM(Tabela14[[#This Row],[Data]],2)","v":11},2018,"Marzec"]
["2018-03-13","Zmiana A",2113026,19,69,13,"Marzec",{"$f":"WEEKNUM(Tabela14[[#This Row],[Data]],2)","v":11},2018,"Marzec"]
["2018-03-13","Zmiana A","33501F",1329,1379,13,"Marzec",{"$f":"WEEKNUM(Tabela14[[#This Row],[Data]],2)","v":11},2018,"Marzec"]
["2018-03-13","Zmiana A",529,82,132,13,"Marzec",{"$f":"WEEKNUM(Tabela14[[#This Row],[Data]],2)","v":11},2018,"Marzec"]
["2018-03-13","Zmiana B",746,316,40,13,"Marzec",{"$f":"WEEKNUM(Tabela14[[#This Row],[Data]],2)","v":11},2018,"Marzec"]
["2018-03-13","Zmiana B",616,63,7,13,"Marzec",{"$f":"WEEKNUM(Tabela14[[#This Row],[Data]],2)","v":11},2018,"Marzec"]
["2018-03-13","Zmiana B",617,162,7,13,"Marzec",{"$f":"WEEKNUM(Tabela14[[#This Row],[Data]],2)","v":11},2018,"Marzec"]
["2018-03-13","Zmiana B",944,38,10,13,"Marzec",{"$f":"WEEKNUM(Tabela14[[#This Row],[Data]],2)","v":11},2018,"Marzec"]
["2018-03-13","Zmiana B",896,311,25,13,"Marzec",{"$f":"WEEKNUM(Tabela14[[#This Row],[Data]],2)","v":11},2018,"Marzec"]
["2018-03-13","Zmiana B",26144994,1076,940,13,"Marzec",{"$f":"WEEKNUM(Tabela14[[#This Row],[Data]],2)","v":11},2018,"Marzec"]
["2018-03-13","Zmiana B",2334641,454,276,13,"Marzec",{"$f":"WEEKNUM(Tabela14[[#This Row],[Data]],2)","v":11},2018,"Marzec"]
["2018-03-13","Zmiana B",693,2553,2437,13,"Marzec",{"$f":"WEEKNUM(Tabela14[[#This Row],[Data]],2)","v":11},2018,"Marzec"]
["2018-03-13","Zmiana B",76,627,572,13,"Marzec",{"$f":"WEEKNUM(Tabela14[[#This Row],[Data]],2)","v":11},2018,"Marzec"]
["2018-03-13","Zmiana B",2297015,566,416,13,"Marzec",{"$f":"WEEKNUM(Tabela14[[#This Row],[Data]],2)","v":11},2018,"Marzec"]
["2018-03-13","Zmiana C",26144994,613,569,13,"Marzec",{"$f":"WEEKNUM(Tabela14[[#This Row],[Data]],2)","v":11},2018,"Marzec"]
["2018-03-13","Zmiana C",498,1571,1605,13,"Marzec",{"$f":"WEEKNUM(Tabela14[[#This Row],[Data]],2)","v":11},2018,"Marzec"]
["2018-03-13","Zmiana C",326,187,199,13,"Marzec",{"$f":"WEEKNUM(Tabela14[[#This Row],[Data]],2)","v":11},2018,"Marzec"]
["2018-03-13","Zmiana C","33505F",211,240,13,"Marzec",{"$f":"WEEKNUM(Tabela14[[#This Row],[Data]],2)","v":11},2018,"Marzec"]
["2018-03-13","Zmiana C",2310044,367,360,13,"Marzec",{"$f":"WEEKNUM(Tabela14[[#This Row],[Data]],2)","v":11},2018,"Marzec"]
["2018-03-14","Zmiana B",179,472,301,14,"Marzec",{"$f":"WEEKNUM(Tabela14[[#This Row],[Data]],2)","v":11},2018,"Marzec"]
["2018-03-14","Zmiana B",269,69,88,14,"Marzec",{"$f":"WEEKNUM(Tabela14[[#This Row],[Data]],2)","v":11},2018,"Marzec"]
["2018-03-14","Zmiana B",358,88,5,14,"Marzec",{"$f":"WEEKNUM(Tabela14[[#This Row],[Data]],2)","v":11},2018,"Marzec"]
["2018-03-14","Zmiana B",560,174,68,14,"Marzec",{"$f":"WEEKNUM(Tabela14[[#This Row],[Data]],2)","v":11},2018,"Marzec"]
["2018-03-14","Zmiana B",41,291,60,14,"Marzec",{"$f":"WEEKNUM(Tabela14[[#This Row],[Data]],2)","v":11},2018,"Marzec"]
["2018-03-14","Zmiana B",101,350,322,14,"Marzec",{"$f":"WEEKNUM(Tabela14[[#This Row],[Data]],2)","v":11},2018,"Marzec"]
["2018-03-14","Zmiana B",2334641,150,120,14,"Marzec",{"$f":"WEEKNUM(Tabela14[[#This Row],[Data]],2)","v":11},2018,"Marzec"]
["2018-03-14","Zmiana B",2334641,156,140,14,"Marzec",{"$f":"WEEKNUM(Tabela14[[#This Row],[Data]],2)","v":11},2018,"Marzec"]
["2018-03-14","Zmiana B",2432300,272,120,14,"Marzec",{"$f":"WEEKNUM(Tabela14[[#This Row],[Data]],2)","v":11},2018,"Marzec"]
["2018-03-14","Zmiana B",966,22,40,14,"Marzec",{"$f":"WEEKNUM(Tabela14[[#This Row],[Data]],2)","v":11},2018,"Marzec"]
["2018-03-14","Zmiana C",845,269,20,14,"Marzec",{"$f":"WEEKNUM(Tabela14[[#This Row],[Data]],2)","v":11},2018,"Marzec"]
["2018-03-14","Zmiana C",844,27,24,14,"Marzec",{"$f":"WEEKNUM(Tabela14[[#This Row],[Data]],2)","v":11},2018,"Marzec"]
["2018-03-14","Zmiana C",378,181,28,14,"Marzec",{"$f":"WEEKNUM(Tabela14[[#This Row],[Data]],2)","v":11},2018,"Marzec"]
["2018-03-14","Zmiana C",724,125,10,14,"Marzec",{"$f":"WEEKNUM(Tabela14[[#This Row],[Data]],2)","v":11},2018,"Marzec"]
["2018-03-14","Zmiana C",310,311,30,14,"Marzec",{"$f":"WEEKNUM(Tabela14[[#This Row],[Data]],2)","v":11},2018,"Marzec"]
["2018-03-14","Zmiana C",26144994,484,378,14,"Marzec",{"$f":"WEEKNUM(Tabela14[[#This Row],[Data]],2)","v":11},2018,"Marzec"]
["2018-03-14","Zmiana C",498,1212,977,14,"Marzec",{"$f":"WEEKNUM(Tabela14[[#This Row],[Data]],2)","v":11},2018,"Marzec"]
["2018-03-14","Zmiana C",326,985,1000,14,"Marzec",{"$f":"WEEKNUM(Tabela14[[#This Row],[Data]],2)","v":11},2018,"Marzec"]
["2018-03-14","Zmiana C",2451636,522,330,14,"Marzec",{"$f":"WEEKNUM(Tabela14[[#This Row],[Data]],2)","v":11},2018,"Marzec"]
["2018-03-15","Zmiana A",179,116,55,15,"Marzec",{"$f":"WEEKNUM(Tabela14[[#This Row],[Data]],2)","v":11},2018,"Marzec"]
["2018-03-15","Zmiana A","346F",460,400,15,"Marzec",{"$f":"WEEKNUM(Tabela14[[#This Row],[Data]],2)","v":11},2018,"Marzec"]
["2018-03-15","Zmiana A","718F",27,26,15,"Marzec",{"$f":"WEEKNUM(Tabela14[[#This Row],[Data]],2)","v":11},2018,"Marzec"]
["2018-03-15","Zmiana A",634,626,360,15,"Marzec",{"$f":"WEEKNUM(Tabela14[[#This Row],[Data]],2)","v":11},2018,"Marzec"]
["2018-03-15","Zmiana A",37,234,90,15,"Marzec",{"$f":"WEEKNUM(Tabela14[[#This Row],[Data]],2)","v":11},2018,"Marzec"]
["2018-03-15","Zmiana A",593,65,80,15,"Marzec",{"$f":"WEEKNUM(Tabela14[[#This Row],[Data]],2)","v":11},2018,"Marzec"]
["2018-03-15","Zmiana A",761,27,60,15,"Marzec",{"$f":"WEEKNUM(Tabela14[[#This Row],[Data]],2)","v":11},2018,"Marzec"]
["2018-03-15","Zmiana A",326,2425,2195,{"$f":"IF(A1346=\"\",\"\",DAY(A1346))","v":15},{"$f":"IFERROR(VLOOKUP(IF(A1346=\"\",\"\",MONTH(A1346)),$P$3:$Q$14,2,FALSE),\"\")","v":"Marzec"},{"$f":"WEEKNUM(Tabela14[[#This Row],[Data]],2)","v":11},{"$f":"IF(A1346=\"\",\"\",YEAR(A1346))","v":2018},{"$f":"G1346","v":"Marzec"}]
["2018-03-15","Zmiana A",498,1128,994,15,"Marzec",{"$f":"WEEKNUM(Tabela14[[#This Row],[Data]],2)","v":11},2018,"Marzec"]
["2018-03-15","Zmiana A",2432300,982,800,15,"Marzec",{"$f":"WEEKNUM(Tabela14[[#This Row],[Data]],2)","v":11},2018,"Marzec"]
["2018-03-15","Zmiana A","300F",462,260,15,"Marzec",{"$f":"WEEKNUM(Tabela14[[#This Row],[Data]],2)","v":11},2018,"Marzec"]
["2018-03-15","Zmiana C",431,587,386,15,"Marzec",{"$f":"WEEKNUM(Tabela14[[#This Row],[Data]],2)","v":11},2018,"Marzec"]
["2018-03-15","Zmiana C",498,2530,2312,15,"Marzec",{"$f":"WEEKNUM(Tabela14[[#This Row],[Data]],2)","v":11},2018,"Marzec"]
["2018-03-15","Zmiana C",2451636,39,60,15,"Marzec",{"$f":"WEEKNUM(Tabela14[[#This Row],[Data]],2)","v":11},2018,"Marzec"]
["2018-03-16","Zmiana A",2297015,373,143,16,"Marzec",{"$f":"WEEKNUM(Tabela14[[#This Row],[Data]],2)","v":11},2018,"Marzec"]
["2018-03-16","Zmiana A",1901726,272,210,16,"Marzec",{"$f":"WEEKNUM(Tabela14[[#This Row],[Data]],2)","v":11},2018,"Marzec"]
["2018-03-16","Zmiana A","334F",888,813,16,"Marzec",{"$f":"WEEKNUM(Tabela14[[#This Row],[Data]],2)","v":11},2018,"Marzec"]
["2018-03-16","Zmiana A",701,83,12,16,"Marzec",{"$f":"WEEKNUM(Tabela14[[#This Row],[Data]],2)","v":11},2018,"Marzec"]
["2018-03-16","Zmiana A",812,1016,910,16,"Marzec",{"$f":"WEEKNUM(Tabela14[[#This Row],[Data]],2)","v":11},2018,"Marzec"]
["2018-03-16","Zmiana A",48,57,80,16,"Marzec",{"$f":"WEEKNUM(Tabela14[[#This Row],[Data]],2)","v":11},2018,"Marzec"]
["2018-03-16","Zmiana A",319,126,20,16,"Marzec",{"$f":"WEEKNUM(Tabela14[[#This Row],[Data]],2)","v":11},2018,"Marzec"]
["2018-03-16","Zmiana A",2001723,214,12,16,"Marzec",{"$f":"WEEKNUM(Tabela14[[#This Row],[Data]],2)","v":11},2018,"Marzec"]
["2018-03-16","Zmiana A",369,281,18,16,"Marzec",{"$f":"WEEKNUM(Tabela14[[#This Row],[Data]],2)","v":11},2018,"Marzec"]
["2018-03-16","Zmiana A",554,116,10,16,"Marzec",{"$f":"WEEKNUM(Tabela14[[#This Row],[Data]],2)","v":11},2018,"Marzec"]
["2018-03-16","Zmiana A",326,2984,2882,16,"Marzec",{"$f":"WEEKNUM(Tabela14[[#This Row],[Data]],2)","v":11},2018,"Marzec"]
["2018-03-16","Zmiana A","717F",480,520,16,"Marzec",{"$f":"WEEKNUM(Tabela14[[#This Row],[Data]],2)","v":11},2018,"Marzec"]
["2018-03-16","Zmiana A",2310044,542,624,16,"Marzec",{"$f":"WEEKNUM(Tabela14[[#This Row],[Data]],2)","v":11},2018,"Marzec"]
["2018-03-16","Zmiana B",1533713,130,211,16,"Marzec",{"$f":"WEEKNUM(Tabela14[[#This Row],[Data]],2)","v":11},2018,"Marzec"]
["2018-03-16","Zmiana B",119,833,560,16,"Marzec",{"$f":"WEEKNUM(Tabela14[[#This Row],[Data]],2)","v":11},2018,"Marzec"]
["2018-03-16","Zmiana B",356,396,260,16,"Marzec",{"$f":"WEEKNUM(Tabela14[[#This Row],[Data]],2)","v":11},2018,"Marzec"]
["2018-03-16","Zmiana B",2297015,523,351,16,"Marzec",{"$f":"WEEKNUM(Tabela14[[#This Row],[Data]],2)","v":11},2018,"Marzec"]
["2018-03-16","Zmiana C",326,2411,2224,16,"Marzec",{"$f":"WEEKNUM(Tabela14[[#This Row],[Data]],2)","v":11},2018,"Marzec"]
["2018-03-16","Zmiana C",26144994,184,190,16,"Marzec",{"$f":"WEEKNUM(Tabela14[[#This Row],[Data]],2)","v":11},2018,"Marzec"]
["2018-03-16","Zmiana C",22,500,240,16,"Marzec",{"$f":"WEEKNUM(Tabela14[[#This Row],[Data]],2)","v":11},2018,"Marzec"]
["2018-03-16","Zmiana C",2237976,552,480,16,"Marzec",{"$f":"WEEKNUM(Tabela14[[#This Row],[Data]],2)","v":11},2018,"Marzec"]
["2018-03-17","Zmiana A",26144994,730,601,17,"Marzec",{"$f":"WEEKNUM(Tabela14[[#This Row],[Data]],2)","v":11},2018,"Marzec"]
["2018-03-17","Zmiana A",498,175,199,17,"Marzec",{"$f":"WEEKNUM(Tabela14[[#This Row],[Data]],2)","v":11},2018,"Marzec"]
["2018-03-17","Zmiana A",560,265,20,17,"Marzec",{"$f":"WEEKNUM(Tabela14[[#This Row],[Data]],2)","v":11},2018,"Marzec"]
["2018-03-17","Zmiana A",2432300,170,46,17,"Marzec",{"$f":"WEEKNUM(Tabela14[[#This Row],[Data]],2)","v":11},2018,"Marzec"]
["2018-03-17","Zmiana A",787,153,185,17,"Marzec",{"$f":"WEEKNUM(Tabela14[[#This Row],[Data]],2)","v":11},2018,"Marzec"]
["2018-03-17","Zmiana A",733,82,10,17,"Marzec",{"$f":"WEEKNUM(Tabela14[[#This Row],[Data]],2)","v":11},2018,"Marzec"]
["2018-03-17","Zmiana A",797,108,8,17,"Marzec",{"$f":"WEEKNUM(Tabela14[[#This Row],[Data]],2)","v":11},2018,"Marzec"]
["2018-03-17","Zmiana A",1745895,39,35,17,"Marzec",{"$f":"WEEKNUM(Tabela14[[#This Row],[Data]],2)","v":11},2018,"Marzec"]
["2018-03-17","Zmiana A",160,259,251,17,"Marzec",{"$f":"WEEKNUM(Tabela14[[#This Row],[Data]],2)","v":11},2018,"Marzec"]
["2018-03-17","Zmiana A",2035613,348,147,17,"Marzec",{"$f":"WEEKNUM(Tabela14[[#This Row],[Data]],2)","v":11},2018,"Marzec"]
["2018-03-17","Zmiana A","33503F",1542,1387,17,"Marzec",{"$f":"WEEKNUM(Tabela14[[#This Row],[Data]],2)","v":11},2018,"Marzec"]
["2018-03-17","Zmiana A",1901726,350,93,17,"Marzec",{"$f":"WEEKNUM(Tabela14[[#This Row],[Data]],2)","v":11},2018,"Marzec"]
["2018-03-17","Zmiana A","721F",259,343,17,"Marzec",{"$f":"WEEKNUM(Tabela14[[#This Row],[Data]],2)","v":11},2018,"Marzec"]
["2018-03-17","Zmiana A",812,514,590,17,"Marzec",{"$f":"WEEKNUM(Tabela14[[#This Row],[Data]],2)","v":11},2018,"Marzec"]
["2018-03-19","Zmiana A",119,60,49,19,"Marzec",{"$f":"WEEKNUM(Tabela14[[#This Row],[Data]],2)","v":12},2018,"Marzec"]
["2018-03-19","Zmiana A",2030723,947,817,19,"Marzec",{"$f":"WEEKNUM(Tabela14[[#This Row],[Data]],2)","v":12},2018,"Marzec"]
["2018-03-19","Zmiana A","33501F",425,428,19,"Marzec",{"$f":"WEEKNUM(Tabela14[[#This Row],[Data]],2)","v":12},2018,"Marzec"]
["2018-03-19","Zmiana A",31,49,1,19,"Marzec",{"$f":"WEEKNUM(Tabela14[[#This Row],[Data]],2)","v":12},2018,"Marzec"]
["2018-03-19","Zmiana A",2310044,185,6,19,"Marzec",{"$f":"WEEKNUM(Tabela14[[#This Row],[Data]],2)","v":12},2018,"Marzec"]
["2018-03-19","Zmiana A",944,263,2,19,"Marzec",{"$f":"WEEKNUM(Tabela14[[#This Row],[Data]],2)","v":12},2018,"Marzec"]
["2018-03-19","Zmiana A",101,254,2,19,"Marzec",{"$f":"WEEKNUM(Tabela14[[#This Row],[Data]],2)","v":12},2018,"Marzec"]
["2018-03-19","Zmiana A",498,1899,1804,19,"Marzec",{"$f":"WEEKNUM(Tabela14[[#This Row],[Data]],2)","v":12},2018,"Marzec"]
["2018-03-19","Zmiana A",812,857,923,19,"Marzec",{"$f":"WEEKNUM(Tabela14[[#This Row],[Data]],2)","v":12},2018,"Marzec"]
["2018-03-19","Zmiana A",570,500,312,19,"Marzec",{"$f":"WEEKNUM(Tabela14[[#This Row],[Data]],2)","v":12},2018,"Marzec"]
["2018-03-19","Zmiana A",252,514,295,19,"Marzec",{"$f":"WEEKNUM(Tabela14[[#This Row],[Data]],2)","v":12},2018,"Marzec"]
["2018-03-19","Zmiana A","716F",772,541,19,"Marzec",{"$f":"WEEKNUM(Tabela14[[#This Row],[Data]],2)","v":12},2018,"Marzec"]
["2018-03-19","Zmiana A",119,27,49,19,"Marzec",{"$f":"WEEKNUM(Tabela14[[#This Row],[Data]],2)","v":12},2018,"Marzec"]
["2018-03-19","Zmiana A",2030723,856,817,19,"Marzec",{"$f":"WEEKNUM(Tabela14[[#This Row],[Data]],2)","v":12},2018,"Marzec"]
["2018-03-19","Zmiana A","33501F",467,428,19,"Marzec",{"$f":"WEEKNUM(Tabela14[[#This Row],[Data]],2)","v":12},2018,"Marzec"]
["2018-03-19","Zmiana A",31,48,1,19,"Marzec",{"$f":"WEEKNUM(Tabela14[[#This Row],[Data]],2)","v":12},2018,"Marzec"]
["2018-03-19","Zmiana A",2310044,57,6,19,"Marzec",{"$f":"WEEKNUM(Tabela14[[#This Row],[Data]],2)","v":12},2018,"Marzec"]
["2018-03-19","Zmiana A",944,259,2,19,"Marzec",{"$f":"WEEKNUM(Tabela14[[#This Row],[Data]],2)","v":12},2018,"Marzec"]
["2018-03-19","Zmiana A",101,4,2,19,"Marzec",{"$f":"WEEKNUM(Tabela14[[#This Row],[Data]],2)","v":12},2018,"Marzec"]
["2018-03-19","Zmiana A",498,2099,1804,19,"Marzec",{"$f":"WEEKNUM(Tabela14[[#This Row],[Data]],2)","v":12},2018,"Marzec"]
["2018-03-19","Zmiana A",812,1016,923,19,"Marzec",{"$f":"WEEKNUM(Tabela14[[#This Row],[Data]],2)","v":12},2018,"Marzec"]
["2018-03-19","Zmiana A",570,309,312,19,"Marzec",{"$f":"WEEKNUM(Tabela14[[#This Row],[Data]],2)","v":12},2018,"Marzec"]
["2018-03-19","Zmiana A",252,322,295,{"$f":"IF(A1410=\"\",\"\",DAY(A1410))","v":19},{"$f":"IFERROR(VLOOKUP(IF(A1410=\"\",\"\",MONTH(A1410)),$P$3:$Q$14,2,FALSE),\"\")","v":"Marzec"},{"$f":"WEEKNUM(Tabela14[[#This Row],[Data]],2)","v":12},{"$f":"IF(A1410=\"\",\"\",YEAR(A1410))","v":2018},{"$f":"G1410","v":"Marzec"}]
["2018-03-19","Zmiana A","716F",810,541,19,"Marzec",{"$f":"WEEKNUM(Tabela14[[#This Row],[Data]],2)","v":12},2018,"Marzec"]
["2018-03-19","Zmiana B",702,185,8,19,"Marzec",{"$f":"WEEKNUM(Tabela14[[#This Row],[Data]],2)","v":12},2018,"Marzec"]
["2018-03-19","Zmiana B",933,665,500,19,"Marzec",{"$f":"WEEKNUM(Tabela14[[#This Row],[Data]],2)","v":12},2018,"Marzec"]
["2018-03-19","Zmiana B",2375097,335,306,19,"Marzec",{"$f":"WEEKNUM(Tabela14[[#This Row],[Data]],2)","v":12},2018,"Marzec"]
["2018-03-19","Zmiana B",498,2594,2581,19,"Marzec",{"$f":"WEEKNUM(Tabela14[[#This Row],[Data]],2)","v":12},2018,"Marzec"]
["2018-03-19","Zmiana C",76,1112,1052,19,"Marzec",{"$f":"WEEKNUM(Tabela14[[#This Row],[Data]],2)","v":12},2018,"Marzec"]
["2018-03-19","Zmiana C",202,244,228,19,"Marzec",{"$f":"WEEKNUM(Tabela14[[#This Row],[Data]],2)","v":12},2018,"Marzec"]
["2018-03-19","Zmiana C",2451636,301,180,19,"Marzec",{"$f":"WEEKNUM(Tabela14[[#This Row],[Data]],2)","v":12},2018,"Marzec"]
["2018-03-19","Zmiana C",498,2305,2398,19,"Marzec",{"$f":"WEEKNUM(Tabela14[[#This Row],[Data]],2)","v":12},2018,"Marzec"]
["2018-03-19","Zmiana C",709,72,7,19,"Marzec",{"$f":"WEEKNUM(Tabela14[[#This Row],[Data]],2)","v":12},2018,"Marzec"]
["2018-03-20","Zmiana A","33503F",476,240,20,"Marzec",{"$f":"WEEKNUM(Tabela14[[#This Row],[Data]],2)","v":12},2018,"Marzec"]
["2018-03-20","Zmiana A",2651043,60,8,20,"Marzec",{"$f":"WEEKNUM(Tabela14[[#This Row],[Data]],2)","v":12},2018,"Marzec"]
["2018-03-20","Zmiana A","716F",421,218,20,"Marzec",{"$f":"WEEKNUM(Tabela14[[#This Row],[Data]],2)","v":12},2018,"Marzec"]
["2018-03-20","Zmiana A","710F",23,60,20,"Marzec",{"$f":"WEEKNUM(Tabela14[[#This Row],[Data]],2)","v":12},2018,"Marzec"]
["2018-03-20","Zmiana A",319,137,20,20,"Marzec",{"$f":"WEEKNUM(Tabela14[[#This Row],[Data]],2)","v":12},2018,"Marzec"]
["2018-03-20","Zmiana A",2297015,280,90,20,"Marzec",{"$f":"WEEKNUM(Tabela14[[#This Row],[Data]],2)","v":12},2018,"Marzec"]
["2018-03-20","Zmiana A",562,73,101,20,"Marzec",{"$f":"WEEKNUM(Tabela14[[#This Row],[Data]],2)","v":12},2018,"Marzec"]
["2018-03-20","Zmiana A",2659560,515,502,20,"Marzec",{"$f":"WEEKNUM(Tabela14[[#This Row],[Data]],2)","v":12},2018,"Marzec"]
["2018-03-20","Zmiana A",498,3290,3115,20,"Marzec",{"$f":"WEEKNUM(Tabela14[[#This Row],[Data]],2)","v":12},2018,"Marzec"]
["2018-03-20","Zmiana A",2310044,541,432,20,"Marzec",{"$f":"WEEKNUM(Tabela14[[#This Row],[Data]],2)","v":12},2018,"Marzec"]
["2018-03-20","Zmiana A",570,616,380,20,"Marzec",{"$f":"WEEKNUM(Tabela14[[#This Row],[Data]],2)","v":12},2018,"Marzec"]
["2018-03-20","Zmiana A",616,52,5,20,"Marzec",{"$f":"WEEKNUM(Tabela14[[#This Row],[Data]],2)","v":12},2018,"Marzec"]
["2018-03-20","Zmiana A",617,6,5,20,"Marzec",{"$f":"WEEKNUM(Tabela14[[#This Row],[Data]],2)","v":12},2018,"Marzec"]
["2018-03-20","Zmiana A","717F",326,419,20,"Marzec",{"$f":"WEEKNUM(Tabela14[[#This Row],[Data]],2)","v":12},2018,"Marzec"]
["2018-03-20","Zmiana B",2632895,298,40,20,"Marzec",{"$f":"WEEKNUM(Tabela14[[#This Row],[Data]],2)","v":12},2018,"Marzec"]
["2018-03-20","Zmiana B",570,118,91,20,"Marzec",{"$f":"WEEKNUM(Tabela14[[#This Row],[Data]],2)","v":12},2018,"Marzec"]
["2018-03-20","Zmiana B",2149709,69,59,20,"Marzec",{"$f":"WEEKNUM(Tabela14[[#This Row],[Data]],2)","v":12},2018,"Marzec"]
["2018-03-20","Zmiana B",546,19,30,20,"Marzec",{"$f":"WEEKNUM(Tabela14[[#This Row],[Data]],2)","v":12},2018,"Marzec"]
["2018-03-20","Zmiana B",498,2277,1995,20,"Marzec",{"$f":"WEEKNUM(Tabela14[[#This Row],[Data]],2)","v":12},2018,"Marzec"]
["2018-03-20","Zmiana B",2310044,394,408,20,"Marzec",{"$f":"WEEKNUM(Tabela14[[#This Row],[Data]],2)","v":12},2018,"Marzec"]
["2018-03-20","Zmiana B",69,634,432,20,"Marzec",{"$f":"WEEKNUM(Tabela14[[#This Row],[Data]],2)","v":12},2018,"Marzec"]
["2018-03-20","Zmiana C",326,2362,2387,20,"Marzec",{"$f":"WEEKNUM(Tabela14[[#This Row],[Data]],2)","v":12},2018,"Marzec"]
["2018-03-20","Zmiana C",15,472,176,20,"Marzec",{"$f":"WEEKNUM(Tabela14[[#This Row],[Data]],2)","v":12},2018,"Marzec"]
["2018-03-20","Zmiana C",2451635,583,390,20,"Marzec",{"$f":"WEEKNUM(Tabela14[[#This Row],[Data]],2)","v":12},2018,"Marzec"]
["2018-03-20","Zmiana C",933,295,191,20,"Marzec",{"$f":"WEEKNUM(Tabela14[[#This Row],[Data]],2)","v":12},2018,"Marzec"]
["2018-03-21","Zmiana A",2067417,197,10,21,"Marzec",{"$f":"WEEKNUM(Tabela14[[#This Row],[Data]],2)","v":12},2018,"Marzec"]
["2018-03-21","Zmiana A",242,27,99,21,"Marzec",{"$f":"WEEKNUM(Tabela14[[#This Row],[Data]],2)","v":12},2018,"Marzec"]
["2018-03-21","Zmiana A",319,148,72,21,"Marzec",{"$f":"WEEKNUM(Tabela14[[#This Row],[Data]],2)","v":12},2018,"Marzec"]
["2018-03-21","Zmiana A",571,560,288,21,"Marzec",{"$f":"WEEKNUM(Tabela14[[#This Row],[Data]],2)","v":12},2018,"Marzec"]
["2018-03-21","Zmiana A",47,273,30,21,"Marzec",{"$f":"WEEKNUM(Tabela14[[#This Row],[Data]],2)","v":12},2018,"Marzec"]
["2018-03-21","Zmiana A",415,300,10,21,"Marzec",{"$f":"WEEKNUM(Tabela14[[#This Row],[Data]],2)","v":12},2018,"Marzec"]
["2018-03-21","Zmiana A",701,295,81,21,"Marzec",{"$f":"WEEKNUM(Tabela14[[#This Row],[Data]],2)","v":12},2018,"Marzec"]
["2018-03-21","Zmiana A","33501F",1008,1072,21,"Marzec",{"$f":"WEEKNUM(Tabela14[[#This Row],[Data]],2)","v":12},2018,"Marzec"]
["2018-03-21","Zmiana A",326,2807,2741,21,"Marzec",{"$f":"WEEKNUM(Tabela14[[#This Row],[Data]],2)","v":12},2018,"Marzec"]
["2018-03-21","Zmiana A",2451636,436,210,21,"Marzec",{"$f":"WEEKNUM(Tabela14[[#This Row],[Data]],2)","v":12},2018,"Marzec"]
["2018-03-21","Zmiana B","33503F",328,80,21,"Marzec",{"$f":"WEEKNUM(Tabela14[[#This Row],[Data]],2)","v":12},2018,"Marzec"]
["2018-03-21","Zmiana B",498,1071,1070,21,"Marzec",{"$f":"WEEKNUM(Tabela14[[#This Row],[Data]],2)","v":12},2018,"Marzec"]
["2018-03-21","Zmiana B",2408708,564,408,21,"Marzec",{"$f":"WEEKNUM(Tabela14[[#This Row],[Data]],2)","v":12},2018,"Marzec"]
["2018-03-21","Zmiana C",269,205,34,21,"Marzec",{"$f":"WEEKNUM(Tabela14[[#This Row],[Data]],2)","v":12},2018,"Marzec"]
["2018-03-21","Zmiana C",966,146,56,21,"Marzec",{"$f":"WEEKNUM(Tabela14[[#This Row],[Data]],2)","v":12},2018,"Marzec"]
["2018-03-21","Zmiana C",2007977,337,60,21,"Marzec",{"$f":"WEEKNUM(Tabela14[[#This Row],[Data]],2)","v":12},2018,"Marzec"]
["2018-03-21","Zmiana C",2451636,266,120,21,"Marzec",{"$f":"WEEKNUM(Tabela14[[#This Row],[Data]],2)","v":12},2018,"Marzec"]
["2018-03-21","Zmiana C",498,2487,2381,21,"Marzec",{"$f":"WEEKNUM(Tabela14[[#This Row],[Data]],2)","v":12},2018,"Marzec"]
["2018-03-22","Zmiana A","717F",200,68,22,"Marzec",{"$f":"WEEKNUM(Tabela14[[#This Row],[Data]],2)","v":12},2018,"Marzec"]
["2018-03-22","Zmiana A",2297015,343,52,22,"Marzec",{"$f":"WEEKNUM(Tabela14[[#This Row],[Data]],2)","v":12},2018,"Marzec"]
["2018-03-22","Zmiana A",2408708,103,17,22,"Marzec",{"$f":"WEEKNUM(Tabela14[[#This Row],[Data]],2)","v":12},2018,"Marzec"]
["2018-03-22","Zmiana A",416,204,20,22,"Marzec",{"$f":"WEEKNUM(Tabela14[[#This Row],[Data]],2)","v":12},2018,"Marzec"]
["2018-03-22","Zmiana A",2067417,278,10,22,"Marzec",{"$f":"WEEKNUM(Tabela14[[#This Row],[Data]],2)","v":12},2018,"Marzec"]
["2018-03-22","Zmiana A",418,35,10,22,"Marzec",{"$f":"WEEKNUM(Tabela14[[#This Row],[Data]],2)","v":12},2018,"Marzec"]
["2018-03-22","Zmiana A",498,2533,2391,22,"Marzec",{"$f":"WEEKNUM(Tabela14[[#This Row],[Data]],2)","v":12},2018,"Marzec"]
["2018-03-22","Zmiana A",497,298,6,22,"Marzec",{"$f":"WEEKNUM(Tabela14[[#This Row],[Data]],2)","v":12},2018,"Marzec"]
["2018-03-22","Zmiana A",529,236,6,22,"Marzec",{"$f":"WEEKNUM(Tabela14[[#This Row],[Data]],2)","v":12},2018,"Marzec"]
["2018-03-22","Zmiana A",812,748,726,22,"Marzec",{"$f":"WEEKNUM(Tabela14[[#This Row],[Data]],2)","v":12},2018,"Marzec"]
["2018-03-22","Zmiana A",2432300,585,460,{"$f":"IF(A1474=\"\",\"\",DAY(A1474))","v":22},{"$f":"IFERROR(VLOOKUP(IF(A1474=\"\",\"\",MONTH(A1474)),$P$3:$Q$14,2,FALSE),\"\")","v":"Marzec"},{"$f":"WEEKNUM(Tabela14[[#This Row],[Data]],2)","v":12},{"$f":"IF(A1474=\"\",\"\",YEAR(A1474))","v":2018},{"$f":"G1474","v":"Marzec"}]
["2018-03-22","Zmiana A",179,934,960,22,"Marzec",{"$f":"WEEKNUM(Tabela14[[#This Row],[Data]],2)","v":12},2018,"Marzec"]
["2018-03-22","Zmiana A","334F",280,163,22,"Marzec",{"$f":"WEEKNUM(Tabela14[[#This Row],[Data]],2)","v":12},2018,"Marzec"]
["2018-03-22","Zmiana B",2418977,7,18,22,"Marzec",{"$f":"WEEKNUM(Tabela14[[#This Row],[Data]],2)","v":12},2018,"Marzec"]
["2018-03-22","Zmiana B",142,15,59,22,"Marzec",{"$f":"WEEKNUM(Tabela14[[#This Row],[Data]],2)","v":12},2018,"Marzec"]
["2018-03-22","Zmiana B",498,1445,1543,22,"Marzec",{"$f":"WEEKNUM(Tabela14[[#This Row],[Data]],2)","v":12},2018,"Marzec"]
["2018-03-22","Zmiana B",2418976,359,116,22,"Marzec",{"$f":"WEEKNUM(Tabela14[[#This Row],[Data]],2)","v":12},2018,"Marzec"]
["2018-03-22","Zmiana B",845,183,20,22,"Marzec",{"$f":"WEEKNUM(Tabela14[[#This Row],[Data]],2)","v":12},2018,"Marzec"]
["2018-03-22","Zmiana B",21,230,40,22,"Marzec",{"$f":"WEEKNUM(Tabela14[[#This Row],[Data]],2)","v":12},2018,"Marzec"]
["2018-03-22","Zmiana B",894,362,120,22,"Marzec",{"$f":"WEEKNUM(Tabela14[[#This Row],[Data]],2)","v":12},2018,"Marzec"]
["2018-03-22","Zmiana B",31,285,348,22,"Marzec",{"$f":"WEEKNUM(Tabela14[[#This Row],[Data]],2)","v":12},2018,"Marzec"]
["2018-03-22","Zmiana B",2007977,21,71,22,"Marzec",{"$f":"WEEKNUM(Tabela14[[#This Row],[Data]],2)","v":12},2018,"Marzec"]
["2018-03-22","Zmiana B",269,35,40,22,"Marzec",{"$f":"WEEKNUM(Tabela14[[#This Row],[Data]],2)","v":12},2018,"Marzec"]
["2018-03-22","Zmiana B",575,62,120,22,"Marzec",{"$f":"WEEKNUM(Tabela14[[#This Row],[Data]],2)","v":12},2018,"Marzec"]
["2018-03-22","Zmiana B",641,207,300,22,"Marzec",{"$f":"WEEKNUM(Tabela14[[#This Row],[Data]],2)","v":12},2018,"Marzec"]
["2018-03-22","Zmiana C",31,421,240,22,"Marzec",{"$f":"WEEKNUM(Tabela14[[#This Row],[Data]],2)","v":12},2018,"Marzec"]
["2018-03-22","Zmiana C",2007977,56,71,22,"Marzec",{"$f":"WEEKNUM(Tabela14[[#This Row],[Data]],2)","v":12},2018,"Marzec"]
["2018-03-22","Zmiana C",269,127,40,22,"Marzec",{"$f":"WEEKNUM(Tabela14[[#This Row],[Data]],2)","v":12},2018,"Marzec"]
["2018-03-22","Zmiana C",575,132,134,22,"Marzec",{"$f":"WEEKNUM(Tabela14[[#This Row],[Data]],2)","v":12},2018,"Marzec"]
["2018-03-22","Zmiana C",933,524,309,22,"Marzec",{"$f":"WEEKNUM(Tabela14[[#This Row],[Data]],2)","v":12},2018,"Marzec"]
["2018-03-22","Zmiana C",498,2578,2386,22,"Marzec",{"$f":"WEEKNUM(Tabela14[[#This Row],[Data]],2)","v":12},2018,"Marzec"]

{"sheet":"Archiwum_Wyk","index":1,"n_rows":1494,"n_cols":17,"rows_kept":1494,"cut":false,"hidden":false,"merged":[]}
["Data","Zmiana","Numer detalu","Zrealizowana ilość \n[szt.]","Ilość braków [szt.]:","Całkowita ilość","Dzień:","Miesiąc:","Rok:","Miesiąc2"]
[43102,"II",894,120,null,{"$f":"IF(A2=\"\",\"\",D2+E2)","v":120},{"$f":"IF(A2=\"\",\"\",DAY(A2))","v":2},{"$f":"IFERROR(VLOOKUP(IF(A2=\"\",\"\",MONTH(A2)),$P$3:$Q$14,2,FALSE),\"\")","v":"Styczeń"},{"$f":"IF(A2=\"\",\"\",YEAR(A2))","v":2018},{"$f":"H2","v":"Styczeń"}]
[43102,"II",2494417,13,null,{"$f":"IF(A3=\"\",\"\",D3+E3)","v":13},2,"Styczeń",2018,{"$f":"H3","v":"Styczeń"},null,null,null,null,null,1,"Styczeń"]
[43102,"II",319,20,null,{"$f":"IF(A4=\"\",\"\",D4+E4)","v":20},2,"Styczeń",2018,{"$f":"H4","v":"Styczeń"},null,null,null,null,null,2,"Luty"]
[43102,"II",101,20,null,{"$f":"IF(A5=\"\",\"\",D5+E5)","v":20},2,"Styczeń",2018,{"$f":"H5","v":"Styczeń"},null,null,null,null,null,3,"Marzec"]
[43102,"II",76,1008,null,{"$f":"IF(A6=\"\",\"\",D6+E6)","v":1008},2,"Styczeń",2018,{"$f":"H6","v":"Styczeń"},null,null,null,null,null,4,"Kwiecień"]
[43102,"II",498,783,2,{"$f":"IF(A7=\"\",\"\",D7+E7)","v":785},2,"Styczeń",2018,{"$f":"H7","v":"Styczeń"},null,null,null,null,null,5,"Maj"]
[43102,"II",326,1586,8,1594,2,"Styczeń",2018,"Styczeń",null,null,null,null,null,6,"Czerwiec"]
[43103,"I","33503F",250,4,254,3,"Styczeń",2018,"Styczeń",null,null,null,null,null,7,"Lipiec"]
[43103,"I","708F",144,52,196,3,"Styczeń",2018,"Styczeń",null,null,null,null,null,8,"Sierpień"]
[43103,"I",326,992,3,995,3,"Styczeń",2018,"Styczeń",null,null,null,null,null,9,"Wrzesień"]
[43103,"I",498,1675,null,1675,3,"Styczeń",2018,"Styczeń",null,null,null,null,null,10,"Październik"]
[43103,"I","334F",764,30,794,3,"Styczeń",2018,"Styczeń",null,null,null,null,null,11,"Listopad"]
[43103,"I",570,340,null,340,3,"Styczeń",2018,"Styczeń",null,null,null,null,null,12,"Grudzień"]
[43103,"I",414,10,null,10,3,"Styczeń",2018,"Styczeń"]
[43103,"I",2505258,6,null,6,3,"Styczeń",2018,"Styczeń"]
[43103,"I",812,250,null,250,3,"Styczeń",2018,"Styczeń"]
[43103,"I",562,1,null,1,3,"Styczeń",2018,"Styczeń"]
[43103,"I",192,5,null,5,3,"Styczeń",2018,"Styczeń"]
[43103,"I",761,15,28,43,3,"Styczeń",2018,"Styczeń"]
[43103,"I",888,40,null,40,3,"Styczeń",2018,"Styczeń"]
[43103,"I",101,80,null,80,3,"Styczeń",2018,"Styczeń"]
[43103,"I",2408709,150,null,150,3,"Styczeń",2018,"Styczeń"]
[43103,"I",514,105,2,107,3,"Styczeń",2018,"Styczeń"]
[43103,"II",356,99,null,99,3,"Styczeń",2018,"Styczeń"]
[43103,"II",198,301,3,304,3,"Styczeń",2018,"Styczeń"]
[43103,"II",845,20,null,20,3,"Styczeń",2018,"Styczeń"]
[43103,"II",746,40,3,43,3,"Styczeń",2018,"Styczeń"]
[43103,"II","33501f",219,3,222,3,"Styczeń",2018,"Styczeń"]
[43103,"II",933,550,null,550,3,"Styczeń",2018,"Styczeń"]
[43103,"II",2418977,180,29,209,3,"Styczeń",2018,"Styczeń"]
[43103,"III",791,200,null,200,3,"Styczeń",2018,"Styczeń"]
[43103,"III",780,120,null,120,3,"Styczeń",2018,"Styczeń"]
[43103,"III",933,300,6,306,3,"Styczeń",2018,"Styczeń"]
[43103,"III",498,2393,1,2394,3,"Styczeń",2018,"Styczeń"]
[43103,"III",269,81,null,81,3,"Styczeń",2018,"Styczeń"]
[43103,"III",310,60,null,60,3,"Styczeń",2018,"Styczeń"]
[43103,"III",895,21,null,21,3,"Styczeń",2018,"Styczeń"]
[43104,"II",252,252,8,260,4,"Styczeń",2018,"Styczeń"]
[43104,"II",2296305,400,null,400,4,"Styczeń",2018,"Styczeń"]
[43104,"II",69,261,99,360,4,"Styczeń",2018,"Styczeń"]
[43104,"II",498,1001,null,1001,4,"Styczeń",2018,"Styczeń"]
[43104,"II",119,240,3,243,4,"Styczeń",2018,"Styczeń"]
[43104,"II",812,798,59,857,4,"Styczeń",2018,"Styczeń"]
[43104,"II",2451635,33,null,33,4,"Styczeń",2018,"Styczeń"]
[43104,"II",2334641,147,null,147,4,"Styczeń",2018,"Styczeń"]
[43104,"II",498,2170,19,2189,4,"Styczeń",2018,"Styczeń"]
[43104,"II",26144994,98,null,98,4,"Styczeń",2018,"Styczeń"]
[43104,"II",812,121,16,137,4,"Styczeń",2018,"Styczeń"]
[43105,"I",197,3,null,3,5,"Styczeń",2018,"Styczeń"]
[43105,"I",2451635,230,1,231,5,"Styczeń",2018,"Styczeń"]
[43105,"I",356,110,null,110,5,"Styczeń",2018,"Styczeń"]
[43105,"I",39,20,null,20,5,"Styczeń",2018,"Styczeń"]
[43105,"I",467,13,5,18,5,"Styczeń",2018,"Styczeń"]
[43105,"I",843,10,null,10,5,"Styczeń",2018,"Styczeń"]
[43105,"I",896,25,null,25,5,"Styczeń",2018,"Styczeń"]
[43105,"I",498,2400,null,2400,5,"Styczeń",2018,"Styczeń"]
[43105,"I",26144994,189,null,189,5,"Styczeń",2018,"Styczeń"]
[43105,"I",119,600,27,627,5,"Styczeń",2018,"Styczeń"]
[43105,"I",571,540,5,545,5,"Styczeń",2018,"Styczeń"]
[43105,"I",2451636,180,null,180,5,"Styczeń",2018,"Styczeń"]
[43105,"II",198,164,3,167,5,"Styczeń",2018,"Styczeń"]
[43105,"II",812,861,null,861,5,"Styczeń",2018,"Styczeń"]
[43105,"II",570,360,179,539,5,"Styczeń",2018,"Styczeń"]
[43105,"II",1533713,50,null,50,5,"Styczeń",2018,"Styczeń"]
[43105,"II",467,7,null,7,{"$f":"IF(A66=\"\",\"\",DAY(A66))","v":5},{"$f":"IFERROR(VLOOKUP(IF(A66=\"\",\"\",MONTH(A66)),$P$3:$Q$14,2,FALSE),\"\")","v":"Styczeń"},{"$f":"IF(A66=\"\",\"\",YEAR(A66))","v":2018},"Styczeń"]
[43105,"II",2418976,90,null,90,5,"Styczeń",2018,"Styczeń"]
[43105,"II",437,175,null,175,5,"Styczeń",2018,"Styczeń"]
[43105,"III",2297015,377,32,409,5,"Styczeń",2018,"Styczeń"]
[43105,"III",179,919,31,950,5,"Styczeń",2018,"Styczeń"]
[43105,"III",2297015,13,735,{"$f":"IF(A71=\"\",\"\",D71+E71)","v":748},5,"Styczeń",2018,{"$f":"H71","v":"Styczeń"}]
[43105,"III",498,1982,null,1982,5,"Styczeń",2018,"Styczeń"]
[43105,"III",26144994,378,null,378,5,"Styczeń",2018,"Styczeń"]
[43105,"III",791,71,null,71,5,"Styczeń",2018,"Styczeń"]
[43105,"III",780,60,null,60,5,"Styczeń",2018,"Styczeń"]
[43108,"I",2632895,38,null,38,8,"Styczeń",2018,"Styczeń"]
[43108,"I","721F",70,1,71,8,"Styczeń",2018,"Styczeń"]
[43108,"I",26144994,757,null,757,8,"Styczeń",2018,"Styczeń"]
[43108,"I",498,1779,null,1779,8,"Styczeń",2018,"Styczeń"]
[43108,"I","705F",60,null,60,8,"Styczeń",2018,"Styczeń"]
[43108,"I",179,31,null,31,8,"Styczeń",2018,"Styczeń"]
[43108,"I",162,6,null,6,8,"Styczeń",2018,"Styczeń"]
[43108,"I",469,1,null,1,8,"Styczeń",2018,"Styczeń"]
[43108,"I",526,2,null,2,8,"Styczeń",2018,"Styczeń"]
[43108,"I","719F",10,null,10,8,"Styczeń",2018,"Styczeń"]
[43108,"I",593,3,null,3,8,"Styczeń",2018,"Styczeń"]
[43108,"I",817,1,null,1,8,"Styczeń",2018,"Styczeń"]
[43108,"I",2505258,6,null,6,8,"Styczeń",2018,"Styczeń"]
[43108,"I",2296305,300,4,304,8,"Styczeń",2018,"Styczeń"]
[43108,"I","334F",897,6,903,8,"Styczeń",2018,"Styczeń"]
[43108,"I",97,60,null,60,8,"Styczeń",2018,"Styczeń"]
[43108,"I","717F",82,null,82,8,"Styczeń",2018,"Styczeń"]
[43108,"II",702,27,null,27,8,"Styczeń",2018,"Styczeń"]
[43108,"II",498,1015,null,1015,8,"Styczeń",2018,"Styczeń"]
[43108,"II",2310044,264,null,264,8,"Styczeń",2018,"Styczeń"]
[43108,"II","705F",20,null,20,8,"Styczeń",2018,"Styczeń"]
[43108,"II",198,462,1,463,8,"Styczeń",2018,"Styczeń"]
[43108,"II",2310044,72,null,72,8,"Styczeń",2018,"Styczeń"]
[43108,"II",526,13,null,13,8,"Styczeń",2018,"Styczeń"]
[43108,"II",26144994,936,1,937,8,"Styczeń",2018,"Styczeń"]
[43108,"II",634,137,14,151,8,"Styczeń",2018,"Styczeń"]
[43108,"II",2310044,168,null,168,8,"Styczeń",2018,"Styczeń"]
[43108,"II",326,599,null,599,8,"Styczeń",2018,"Styczeń"]
[43108,"II",2432300,1000,null,1000,8,"Styczeń",2018,"Styczeń"]
[43108,"II",269,70,null,70,8,"Styczeń",2018,"Styczeń"]
[43108,"II",2494417,111,null,111,8,"Styczeń",2018,"Styczeń"]
[43108,"II",2310044,168,1,169,8,"Styczeń",2018,"Styczeń"]
[43108,"III",326,1991,4,1995,8,"Styczeń",2018,"Styczeń"]
[43108,"III",26144994,379,null,379,8,"Styczeń",2018,"Styczeń"]
[43108,"III",839,213,27,240,8,"Styczeń",2018,"Styczeń"]
[43109,"I","708F",589,74,663,9,"Styczeń",2018,"Styczeń"]
[43109,"I",26144994,270,null,270,9,"Styczeń",2018,"Styczeń"]
[43109,"I",498,2023,null,2023,9,"Styczeń",2018,"Styczeń"]
[43109,"I","717F",409,33,442,9,"Styczeń",2018,"Styczeń"]
[43109,"I",2067417,10,null,10,9,"Styczeń",2018,"Styczeń"]
[43109,"I",418,10,null,10,9,"Styczeń",2018,"Styczeń"]
[43109,"I","800-569488-F",60,null,60,9,"Styczeń",2018,"Styczeń"]
[43109,"I",2001723,40,null,40,9,"Styczeń",2018,"Styczeń"]
[43109,"I",894,170,null,170,9,"Styczeń",2018,"Styczeń"]
[43109,"I",2297015,273,null,273,9,"Styczeń",2018,"Styczeń"]
[43109,"I",359,8,null,8,9,"Styczeń",2018,"Styczeń"]
[43109,"I",701,27,null,27,9,"Styczeń",2018,"Styczeń"]
[43109,"I",701,4,null,4,9,"Styczeń",2018,"Styczeń"]
[43109,"I",2408708,271,63,334,9,"Styczeń",2018,"Styczeń"]
[43109,"I",160,375,null,375,9,"Styczeń",2018,"Styczeń"]
[43109,"I","710F",60,null,60,9,"Styczeń",2018,"Styczeń"]
[43109,"I",888,50,2,52,9,"Styczeń",2018,"Styczeń"]
[43109,"I",37,100,null,100,9,"Styczeń",2018,"Styczeń"]
[43109,"I",1533713,15,63,78,9,"Styczeń",2018,"Styczeń"]
[43109,"II",356,70,null,70,{"$f":"IF(A130=\"\",\"\",DAY(A130))","v":9},{"$f":"IFERROR(VLOOKUP(IF(A130=\"\",\"\",MONTH(A130)),$P$3:$Q$14,2,FALSE),\"\")","v":"Styczeń"},{"$f":"IF(A130=\"\",\"\",YEAR(A130))","v":2018},"Styczeń"]
[43109,"II",845,40,null,40,9,"Styczeń",2018,"Styczeń"]
[43109,"II",844,80,null,80,9,"Styczeń",2018,"Styczeń"]
[43109,"II",2494417,259,null,259,9,"Styczeń",2018,"Styczeń"]
[43109,"II",498,738,null,738,9,"Styczeń",2018,"Styczeń"]
[43109,"II",326,983,14,{"$f":"IF(A135=\"\",\"\",D135+E135)","v":997},9,"Styczeń",2018,{"$f":"H135","v":"Styczeń"}]
[43109,"II",543,375,3,378,9,"Styczeń",2018,"Styczeń"]
[43109,"II",2297015,403,19,422,9,"Styczeń",2018,"Styczeń"]
[43109,"II",275,9,null,9,9,"Styczeń",2018,"Styczeń"]
[43109,"III",326,2384,18,2402,9,"Styczeń",2018,"Styczeń"]
[43109,"III",140,60,null,60,9,"Styczeń",2018,"Styczeń"]
[43109,"III",2001994,36,null,36,9,"Styczeń",2018,"Styczeń"]
[43109,"III",2451635,250,2,252,9,"Styczeń",2018,"Styczeń"]
[43109,"III",2334641,36,null,36,9,"Styczeń",2018,"Styczeń"]
[43109,"III",307,20,null,20,9,"Styczeń",2018,"Styczeń"]
[43109,"III",310,30,null,30,9,"Styczeń",2018,"Styczeń"]
[43109,"III",724,30,null,30,9,"Styczeń",2018,"Styczeń"]
[43109,"III",103,15,null,15,9,"Styczeń",2018,"Styczeń"]
[43110,"I","300F",121,3,124,10,"Styczeń",2018,"Styczeń"]
[43110,"I",554,10,null,10,10,"Styczeń",2018,"Styczeń"]
[43110,"I",545,6,null,6,10,"Styczeń",2018,"Styczeń"]
[43110,"I",996,60,null,60,10,"Styczeń",2018,"Styczeń"]
[43110,"I","713F",120,7,127,10,"Styczeń",2018,"Styczeń"]
[43110,"I",2505258,6,null,6,10,"Styczeń",2018,"Styczeń"]
[43110,"I",702,12,null,12,10,"Styczeń",2018,"Styczeń"]
[43110,"I",767,36,null,36,10,"Styczeń",2018,"Styczeń"]
[43110,"I",593,40,null,40,10,"Styczeń",2018,"Styczeń"]
[43110,"I",2334641,150,null,150,10,"Styczeń",2018,"Styczeń"]
[43110,"I",326,2400,null,2400,10,"Styczeń",2018,"Styczeń"]
[43110,"I",812,863,3,866,10,"Styczeń",2018,"Styczeń"]
[43110,"I","346F",200,null,200,10,"Styczeń",2018,"Styczeń"]
[43110,"II",172,10,null,10,10,"Styczeń",2018,"Styczeń"]
[43110,"II",996,161,29,190,10,"Styczeń",2018,"Styczeń"]
[43110,"II",326,800,null,800,10,"Styczeń",2018,"Styczeń"]
[43110,"II",2220258,178,null,178,10,"Styczeń",2018,"Styczeń"]
[43110,"II",746,60,null,60,10,"Styczeń",2018,"Styczeń"]
[43110,"II",41,40,null,40,10,"Styczeń",2018,"Styczeń"]
[43110,"II",570,170,null,170,10,"Styczeń",2018,"Styczeń"]
[43110,"II",1901726,518,null,518,10,"Styczeń",2018,"Styczeń"]
[43110,"II",2237976,339,null,339,10,"Styczeń",2018,"Styczeń"]
[43110,"II",2451635,270,null,270,10,"Styczeń",2018,"Styczeń"]
[43110,"II",76,154,null,154,10,"Styczeń",2018,"Styczeń"]
[43110,"II",356,447,39,486,10,"Styczeń",2018,"Styczeń"]
[43110,"III",26144994,1515,null,1515,10,"Styczeń",2018,"Styczeń"]
[43110,"III",498,800,null,800,10,"Styczeń",2018,"Styczeń"]
[43110,"III",310,40,null,40,10,"Styczeń",2018,"Styczeń"]
[43110,"III",546,10,null,10,10,"Styczeń",2018,"Styczeń"]
[43110,"III",431,432,17,449,10,"Styczeń",2018,"Styczeń"]
[43111,"I","346F",200,null,200,11,"Styczeń",2018,"Styczeń"]
[43111,"I",269,69,null,69,11,"Styczeń",2018,"Styczeń"]
[43111,"I",153,18,null,18,11,"Styczeń",2018,"Styczeń"]
[43111,"I","33501F",335,1,336,11,"Styczeń",2018,"Styczeń"]
[43111,"I",319,20,null,20,11,"Styczeń",2018,"Styczeń"]
[43111,"I",726,22,null,22,11,"Styczeń",2018,"Styczeń"]
[43111,"I",498,2598,null,2598,11,"Styczeń",2018,"Styczeń"]
[43111,"I",119,600,1,601,11,"Styczeń",2018,"Styczeń"]
[43111,"I",2451636,240,null,240,11,"Styczeń",2018,"Styczeń"]
[43111,"I",787,385,141,526,11,"Styczeń",2018,"Styczeń"]
[43111,"II",812,276,null,276,11,"Styczeń",2018,"Styczeń"]
[43111,"II",2334641,230,null,230,11,"Styczeń",2018,"Styczeń"]
[43111,"II",2297015,108,null,108,11,"Styczeń",2018,"Styczeń"]
[43111,"II",198,238,null,238,11,"Styczeń",2018,"Styczeń"]
[43111,"II",2451636,119,null,119,11,"Styczeń",2018,"Styczeń"]
[43111,"II",275,87,null,87,11,"Styczeń",2018,"Styczeń"]
[43111,"II",560,324,19,343,{"$f":"IF(A194=\"\",\"\",DAY(A194))","v":11},{"$f":"IFERROR(VLOOKUP(IF(A194=\"\",\"\",MONTH(A194)),$P$3:$Q$14,2,FALSE),\"\")","v":"Styczeń"},{"$f":"IF(A194=\"\",\"\",YEAR(A194))","v":2018},"Styczeń"]
[43111,"II",498,1195,2,1197,11,"Styczeń",2018,"Styczeń"]
[43111,"II",101,220,null,220,11,"Styczeń",2018,"Styczeń"]
[43111,"II",437,527,27,554,11,"Styczeń",2018,"Styczeń"]
[43111,"II",787,192,5,197,11,"Styczeń",2018,"Styczeń"]
[43111,"III",26144994,945,null,{"$f":"IF(A199=\"\",\"\",D199+E199)","v":945},11,"Styczeń",2018,{"$f":"H199","v":"Styczeń"}]
[43111,"III",498,1386,11,1397,11,"Styczeń",2018,"Styczeń"]
[43111,"III",119,520,11,531,11,"Styczeń",2018,"Styczeń"]
[43112,"II","717F",491,9,500,12,"Styczeń",2018,"Styczeń"]
[43112,"II",2296305,300,null,300,12,"Styczeń",2018,"Styczeń"]
[43112,"II","334F",339,56,395,12,"Styczeń",2018,"Styczeń"]
[43112,"II",482,10,null,10,12,"Styczeń",2018,"Styczeń"]
[43112,"II",562,10,null,10,12,"Styczeń",2018,"Styczeń"]
[43112,"II",780,22,null,22,12,"Styczeń",2018,"Styczeń"]
[43112,"II",791,9,null,9,12,"Styczeń",2018,"Styczeń"]
[43112,"II",761,30,null,30,12,"Styczeń",2018,"Styczeń"]
[43112,"II",498,2597,null,2597,12,"Styczeń",2018,"Styczeń"]
[43112,"II",812,500,null,500,12,"Styczeń",2018,"Styczeń"]
[43112,"II",76,246,null,246,12,"Styczeń",2018,"Styczeń"]
[43112,"II",812,141,74,215,12,"Styczeń",2018,"Styczeń"]
[43112,"II",560,186,12,198,12,"Styczeń",2018,"Styczeń"]
[43112,"II",2149709,239,null,239,12,"Styczeń",2018,"Styczeń"]
[43112,"II",966,88,null,88,12,"Styczeń",2018,"Styczeń"]
[43112,"II",69,80,null,80,12,"Styczeń",2018,"Styczeń"]
[43112,"II",76,440,null,440,12,"Styczeń",2018,"Styczeń"]
[43112,"II",2551650,16,null,16,12,"Styczeń",2018,"Styczeń"]
[43112,"II",2551651,16,null,16,12,"Styczeń",2018,"Styczeń"]
[43112,"III",498,2369,3,2372,12,"Styczeń",2018,"Styczeń"]
[43115,"I","708F",467,6,473,15,"Styczeń",2018,"Styczeń"]
[43115,"I",2297015,227,null,227,15,"Styczeń",2018,"Styczeń"]
[43115,"I",319,2,null,2,15,"Styczeń",2018,"Styczeń"]
[43115,"I",416,2,null,2,15,"Styczeń",2018,"Styczeń"]
[43115,"I",2067417,10,null,10,15,"Styczeń",2018,"Styczeń"]
[43115,"I",197,3,null,3,15,"Styczeń",2018,"Styczeń"]
[43115,"I","716F",544,11,555,15,"Styczeń",2018,"Styczeń"]
[43115,"I",2510103,15,null,15,15,"Styczeń",2018,"Styczeń"]
[43115,"I",575,15,null,15,15,"Styczeń",2018,"Styczeń"]
[43115,"I",560,32,null,32,15,"Styczeń",2018,"Styczeń"]
[43115,"I",562,30,null,30,15,"Styczeń",2018,"Styczeń"]
[43115,"I",498,2621,null,2621,15,"Styczeń",2018,"Styczeń"]
[43115,"I","705F",16,null,16,15,"Styczeń",2018,"Styczeń"]
[43115,"I","721F",385,14,399,15,"Styczeń",2018,"Styczeń"]
[43115,"I",2310044,336,null,336,15,"Styczeń",2018,"Styczeń"]
[43115,"I",76,858,null,858,15,"Styczeń",2018,"Styczeń"]
[43115,"I","710F",29,null,29,15,"Styczeń",2018,"Styczeń"]
[43115,"II",198,300,null,300,15,"Styczeń",2018,"Styczeń"]
[43115,"II",780,20,null,20,15,"Styczeń",2018,"Styczeń"]
[43115,"II",817,1,null,1,15,"Styczeń",2018,"Styczeń"]
[43115,"II",513,58,96,154,15,"Styczeń",2018,"Styczeń"]
[43115,"II",2432300,711,null,711,15,"Styczeń",2018,"Styczeń"]
[43115,"II",2408708,51,1,52,15,"Styczeń",2018,"Styczeń"]
[43115,"II",2494417,234,4,238,15,"Styczeń",2018,"Styczeń"]
[43115,"II",570,156,39,195,15,"Styczeń",2018,"Styczeń"]
[43115,"II",69,60,null,60,15,"Styczeń",2018,"Styczeń"]
["2018-01-16","II","717F",415,16,{"$f":"IF(A248=\"\",\"\",D248+E248)","v":431},{"$f":"IF(A248=\"\",\"\",DAY(A248))","v":16},{"$f":"IFERROR(VLOOKUP(IF(A248=\"\",\"\",MONTH(A248)),$P$3:$Q$14,2,FALSE),\"\")","v":"Styczeń"},{"$f":"IF(A248=\"\",\"\",YEAR(A248))","v":2018},{"$f":"H248","v":"Styczeń"}]
["2018-01-16","II",2007977,80,null,80,16,"Styczeń",2018,"Styczeń"]
["2018-01-16","II",418,10,null,10,16,"Styczeń",2018,"Styczeń"]
["2018-01-16","II",51,1,null,1,16,"Styczeń",2018,"Styczeń"]
["2018-01-16","II","334F",500,15,515,16,"Styczeń",2018,"Styczeń"]
["2018-01-16","II",469,20,null,20,16,"Styczeń",2018,"Styczeń"]
["2018-01-16","II",701,27,null,27,16,"Styczeń",2018,"Styczeń"]
["2018-01-16","II",2009613,40,null,40,16,"Styczeń",2018,"Styczeń"]
["2018-01-16","II",693,3773,null,3773,16,"Styczeń",2018,"Styczeń"]
["2018-01-16","II",498,2395,null,2395,16,"Styczeń",2018,"Styczeń"]
["2018-01-16","II",26144994,362,null,362,16,"Styczeń",2018,"Styczeń"]
["2018-01-16","II",202,72,null,72,16,"Styczeń",2018,"Styczeń"]
["2018-01-16","II",888,24,2,26,16,"Styczeń",2018,"Styczeń"]
["2018-01-16","II",839,60,null,60,16,"Styczeń",2018,"Styczeń"]
["2018-01-16","II",2451636,221,null,221,16,"Styczeń",2018,"Styczeń"]
["2018-01-16","II",437,128,17,{"$f":"IF(A263=\"\",\"\",D263+E263)","v":145},{"$f":"IF(A263=\"\",\"\",DAY(A263))","v":16},{"$f":"IFERROR(VLOOKUP(IF(A263=\"\",\"\",MONTH(A263)),$P$3:$Q$14,2,FALSE),\"\")","v":"Styczeń"},{"$f":"IF(A263=\"\",\"\",YEAR(A263))","v":2018},{"$f":"H263","v":"Styczeń"}]
["2018-01-16","II",2408708,62,3,65,16,"Styczeń",2018,"Styczeń"]
["2018-01-16","II",2375097,72,null,72,16,"Styczeń",2018,"Styczeń"]
["2018-01-16","II",2310044,600,null,600,16,"Styczeń",2018,"Styczeń"]
["2018-01-16","II",179,537,12,549,16,"Styczeń",2018,"Styczeń"]
["2018-01-16","II",944,20,null,20,16,"Styczeń",2018,"Styczeń"]
["2018-01-16","II",791,20,null,20,16,"Styczeń",2018,"Styczeń"]
["2018-01-16","II",437,128,17,{"$f":"IF(A270=\"\",\"\",D270+E270)","v":145},{"$f":"IF(A270=\"\",\"\",DAY(A270))","v":16},{"$f":"IFERROR(VLOOKUP(IF(A270=\"\",\"\",MONTH(A270)),$P$3:$Q$14,2,FALSE),\"\")","v":"Styczeń"},{"$f":"IF(A270=\"\",\"\",YEAR(A270))","v":2018},{"$f":"H270","v":"Styczeń"}]
["2018-01-16","II",2408708,62,3,65,16,"Styczeń",2018,"Styczeń"]
["2018-01-16","II",2375097,72,null,72,16,"Styczeń",2018,"Styczeń"]
["2018-01-16","II",2310044,600,null,600,16,"Styczeń",2018,"Styczeń"]
["2018-01-16","II",179,537,12,549,16,"Styczeń",2018,"Styczeń"]
["2018-01-16","II",944,20,null,20,16,"Styczeń",2018,"Styczeń"]
["2018-01-16","II",791,20,null,20,16,"Styczeń",2018,"Styczeń"]
["2018-01-16","II",437,128,17,{"$f":"IF(A277=\"\",\"\",D277+E277)","v":145},{"$f":"IF(A277=\"\",\"\",DAY(A277))","v":16},{"$f":"IFERROR(VLOOKUP(IF(A277=\"\",\"\",MONTH(A277)),$P$3:$Q$14,2,FALSE),\"\")","v":"Styczeń"},{"$f":"IF(A277=\"\",\"\",YEAR(A277))","v":2018},{"$f":"H277","v":"Styczeń"}]
["2018-01-16","II",2408708,62,3,65,16,"Styczeń",2018,"Styczeń"]
["2018-01-16","II",2375097,72,null,72,16,"Styczeń",2018,"Styczeń"]
["2018-01-16","II",2310044,600,null,600,16,"Styczeń",2018,"Styczeń"]
["2018-01-16","II",179,537,12,549,16,"Styczeń",2018,"Styczeń"]
["2018-01-16","II",944,20,null,20,16,"Styczeń",2018,"Styczeń"]
["2018-01-16","II",791,20,null,20,16,"Styczeń",2018,"Styczeń"]
["2018-01-16","III",326,1998,null,{"$f":"IF(A284=\"\",\"\",D284+E284)","v":1998},{"$f":"IF(A284=\"\",\"\",DAY(A284))","v":16},{"$f":"IFERROR(VLOOKUP(IF(A284=\"\",\"\",MONTH(A284)),$P$3:$Q$14,2,FALSE),\"\")","v":"Styczeń"},{"$f":"IF(A284=\"\",\"\",YEAR(A284))","v":2018},{"$f":"H284","v":"Styczeń"}]
["2018-01-16","III",26144994,379,null,379,16,"Styczeń",2018,"Styczeń"]
["2018-01-17","II",780,20,null,20,17,"Styczeń",2018,"Styczeń"]
["2018-01-17","II",791,20,null,20,17,"Styczeń",2018,"Styczeń"]
["2018-01-17","II",812,109,null,109,17,"Styczeń",2018,"Styczeń"]
["2018-01-17","II","33501F",697,3,700,17,"Styczeń",2018,"Styczeń"]
["2018-01-17","II",2632895,40,null,40,17,"Styczeń",2018,"Styczeń"]
["2018-01-17","II",2296305,550,null,550,17,"Styczeń",2018,"Styczeń"]
["2018-01-17","II",252,241,3,244,17,"Styczeń",2018,"Styczeń"]
["2018-01-17","III",326,1805,1,{"$f":"IF(A293=\"\",\"\",D293+E293)","v":1806},{"$f":"IF(A293=\"\",\"\",DAY(A293))","v":17},{"$f":"IFERROR(VLOOKUP(IF(A293=\"\",\"\",MONTH(A293)),$P$3:$Q$14,2,FALSE),\"\")","v":"Styczeń"},{"$f":"IF(A293=\"\",\"\",YEAR(A293))","v":2018},{"$f":"H293","v":"Styczeń"}]
["2018-01-17","III",26144994,562,1,563,17,"Styczeń",2018,"Styczeń"]
["2018-01-18","I","710F",91,null,91,18,"Styczeń",2018,"Styczeń"]
["2018-01-18","I","802F",259,null,259,18,"Styczeń",2018,"Styczeń"]
["2018-01-18","I","33501F",344,null,344,18,"Styczeń",2018,"Styczeń"]
["2018-01-18","I","33503F",750,null,750,18,"Styczeń",2018,"Styczeń"]
["2018-01-18","I",812,500,2,502,18,"Styczeń",2018,"Styczeń"]
["2018-01-18","I",958,34,null,34,18,"Styczeń",2018,"Styczeń"]
["2018-01-18","I",570,494,null,494,18,"Styczeń",2018,"Styczeń"]
["2018-01-18","I",498,2566,null,2566,18,"Styczeń",2018,"Styczeń"]
["2018-01-18","I",2007977,40,null,40,18,"Styczeń",2018,"Styczeń"]
["2018-01-18","I",2408708,360,null,360,18,"Styczeń",2018,"Styczeń"]
["2018-01-18","I",202,130,null,130,18,"Styczeń",2018,"Styczeń"]
["2018-01-18","II",701,4,null,{"$f":"IF(A306=\"\",\"\",D306+E306)","v":4},{"$f":"IF(A306=\"\",\"\",DAY(A306))","v":18},{"$f":"IFERROR(VLOOKUP(IF(A306=\"\",\"\",MONTH(A306)),$P$3:$Q$14,2,FALSE),\"\")","v":"Styczeń"},{"$f":"IF(A306=\"\",\"\",YEAR(A306))","v":2018},{"$f":"H306","v":"Styczeń"}]
["2018-01-18","II",617,2,null,2,18,"Styczeń",2018,"Styczeń"]
["2018-01-18","II",780,20,null,20,18,"Styczeń",2018,"Styczeń"]
["2018-01-18","II",791,40,null,40,18,"Styczeń",2018,"Styczeń"]
["2018-01-18","II",894,91,null,91,18,"Styczeń",2018,"Styczeń"]
["2018-01-18","II","33501F",500,1,501,18,"Styczeń",2018,"Styczeń"]
["2018-01-18","II",514,90,null,90,18,"Styczeń",2018,"Styczeń"]
["2018-01-18","II",845,20,null,20,18,"Styczeń",2018,"Styczeń"]
["2018-01-18","II",812,1120,9,1129,18,"Styczeń",2018,"Styczeń"]
["2018-01-18","II",2494417,160,25,185,18,"Styczeń",2018,"Styczeń"]
["2018-01-18","III",326,2355,null,{"$f":"IF(A316=\"\",\"\",D316+E316)","v":2355},{"$f":"IF(A316=\"\",\"\",DAY(A316))","v":18},{"$f":"IFERROR(VLOOKUP(IF(A316=\"\",\"\",MONTH(A316)),$P$3:$Q$14,2,FALSE),\"\")","v":"Styczeń"},{"$f":"IF(A316=\"\",\"\",YEAR(A316))","v":2018},{"$f":"H316","v":"Styczeń"}]
["2018-01-19","I","33505F",5,null,5,19,"Styczeń",2018,"Styczeń"]
["2018-01-19","I","33501F",23,null,23,19,"Styczeń",2018,"Styczeń"]
["2018-01-19","I",643,24,null,24,19,"Styczeń",2018,"Styczeń"]
["2018-01-19","I",319,20,null,20,19,"Styczeń",2018,"Styczeń"]
["2018-01-19","I","33503F",500,8,508,19,"Styczeń",2018,"Styczeń"]
["2018-01-19","I",2126381,50,null,50,19,"Styczeń",2018,"Styczeń"]
["2018-01-19","I",545,6,null,6,19,"Styczeń",2018,"Styczeń"]
["2018-01-19","I",307,18,null,18,19,"Styczeń",2018,"Styczeń"]
["2018-01-19","I",22,251,null,251,19,"Styczeń",2018,"Styczeń"]
["2018-01-19","I",197,3,null,3,19,"Styczeń",2018,"Styczeń"]
["2018-01-19","I",917,25,null,25,19,"Styczeń",2018,"Styczeń"]
["2018-01-19","I",326,2406,null,2406,19,"Styczeń",2018,"Styczeń"]
["2018-01-19","I",2007977,260,null,260,19,"Styczeń",2018,"Styczeń"]
["2018-01-19","I",780,18,null,18,19,"Styczeń",2018,"Styczeń"]
["2018-01-19","I",791,10,null,10,19,"Styczeń",2018,"Styczeń"]
["2018-01-19","II",791,30,null,{"$f":"IF(A332=\"\",\"\",D332+E332)","v":30},{"$f":"IF(A332=\"\",\"\",DAY(A332))","v":19},{"$f":"IFERROR(VLOOKUP(IF(A332=\"\",\"\",MONTH(A332)),$P$3:$Q$14,2,FALSE),\"\")","v":"Styczeń"},{"$f":"IF(A332=\"\",\"\",YEAR(A332))","v":2018},{"$f":"H332","v":"Styczeń"}]
["2018-01-19","II",845,20,null,20,19,"Styczeń",2018,"Styczeń"]
["2018-01-19","II",896,25,null,25,19,"Styczeń",2018,"Styczeń"]
["2018-01-19","II","33505F",97,null,97,19,"Styczeń",2018,"Styczeń"]
["2018-01-19","II",119,600,13,613,19,"Styczeń",2018,"Styczeń"]
["2018-01-19","I","33505F",5,null,5,19,"Styczeń",2018,"Styczeń"]
["2018-01-19","I","33501F",23,null,23,19,"Styczeń",2018,"Styczeń"]
["2018-01-19","I",643,24,null,24,19,"Styczeń",2018,"Styczeń"]
["2018-01-19","I",319,20,null,20,19,"Styczeń",2018,"Styczeń"]
["2018-01-19","I","33503F",500,8,508,19,"Styczeń",2018,"Styczeń"]
["2018-01-19","I",2126381,50,null,50,19,"Styczeń",2018,"Styczeń"]
["2018-01-19","I",545,6,null,6,19,"Styczeń",2018,"Styczeń"]
["2018-01-19","I",307,18,null,18,19,"Styczeń",2018,"Styczeń"]
["2018-01-19","I",22,251,null,251,19,"Styczeń",2018,"Styczeń"]
["2018-01-19","I",197,3,null,3,19,"Styczeń",2018,"Styczeń"]
["2018-01-19","I",917,25,null,25,19,"Styczeń",2018,"Styczeń"]
["2018-01-19","I",326,2406,null,2406,19,"Styczeń",2018,"Styczeń"]
["2018-01-19","I",2007977,260,null,260,19,"Styczeń",2018,"Styczeń"]
["2018-01-19","I",780,18,null,18,19,"Styczeń",2018,"Styczeń"]
["2018-01-19","I",791,10,null,10,19,"Styczeń",2018,"Styczeń"]
["2018-01-19","III",326,399,1,400,19,"Styczeń",2018,"Styczeń"]
["2018-01-19","III",498,1982,null,1982,19,"Styczeń",2018,"Styczeń"]
["2018-01-20","I",888,10,null,{"$f":"IF(A354=\"\",\"\",D354+E354)","v":10},{"$f":"IF(A354=\"\",\"\",DAY(A354))","v":20},{"$f":"IFERROR(VLOOKUP(IF(A354=\"\",\"\",MONTH(A354)),$P$3:$Q$14,2,FALSE),\"\")","v":"Styczeń"},{"$f":"IF(A354=\"\",\"\",YEAR(A354))","v":2018},{"$f":"H354","v":"Styczeń"}]
["2018-01-20","I",812,830,27,857,20,"Styczeń",2018,"Styczeń"]
["2018-01-20","I",2451635,360,null,360,20,"Styczeń",2018,"Styczeń"]
["2018-01-20","I",119,1165,null,1165,20,"Styczeń",2018,"Styczeń"]
["2018-01-20","I",269,170,null,170,20,"Styczeń",2018,"Styczeń"]
["2018-01-20","I",2001994,36,null,36,20,"Styczeń",2018,"Styczeń"]
["2018-01-20","I",724,10,null,10,20,"Styczeń",2018,"Styczeń"]
["2018-01-20","I",733,20,null,20,20,"Styczeń",2018,"Styczeń"]
["2018-01-22","I",933,25,null,{"$f":"IF(A362=\"\",\"\",D362+E362)","v":25},{"$f":"IF(A362=\"\",\"\",DAY(A362))","v":22},{"$f":"IFERROR(VLOOKUP(IF(A362=\"\",\"\",MONTH(A362)),$P$3:$Q$14,2,FALSE),\"\")","v":"Styczeń"},{"$f":"IF(A362=\"\",\"\",YEAR(A362))","v":2018},{"$f":"H362","v":"Styczeń"}]
["2018-01-22","I",761,57,null,57,22,"Styczeń",2018,"Styczeń"]
["2018-01-22","I",2035613,218,null,218,22,"Styczeń",2018,"Styczeń"]
["2018-01-22","I",142,50,null,50,22,"Styczeń",2018,"Styczeń"]
["2018-01-22","I",839,80,null,80,22,"Styczeń",2018,"Styczeń"]
["2018-01-22","I",26144994,373,null,373,22,"Styczeń",2018,"Styczeń"]
["2018-01-22","I",498,2972,null,2972,22,"Styczeń",2018,"Styczeń"]
["2018-01-22","I",154,2,null,2,22,"Styczeń",2018,"Styczeń"]
["2018-01-22","I",119,520,5,525,22,"Styczeń",2018,"Styczeń"]
["2018-01-22","I",469,3,null,3,22,"Styczeń",2018,"Styczeń"]
["2018-01-22","I",547,5,null,5,22,"Styczeń",2018,"Styczeń"]
["2018-01-22","I",894,29,null,29,22,"Styczeń",2018,"Styczeń"]
["2018-01-22","I",888,6,null,6,22,"Styczeń",2018,"Styczeń"]
["2018-01-22","I",812,1082,11,1093,22,"Styczeń",2018,"Styczeń"]
["2018-01-22","I",780,40,null,40,22,"Styczeń",2018,"Styczeń"]
["2018-01-22","I",791,60,null,60,22,"Styczeń",2018,"Styczeń"]
["2018-01-22","II",845,40,null,{"$f":"IF(A378=\"\",\"\",D378+E378)","v":40},{"$f":"IF(A378=\"\",\"\",DAY(A378))","v":22},{"$f":"IFERROR(VLOOKUP(IF(A378=\"\",\"\",MONTH(A378)),$P$3:$Q$14,2,FALSE),\"\")","v":"Styczeń"},{"$f":"IF(A378=\"\",\"\",YEAR(A378))","v":2018},{"$f":"H378","v":"Styczeń"}]
["2018-01-22","II",894,200,null,200,22,"Styczeń",2018,"Styczeń"]
["2018-01-22","II",560,370,null,370,22,"Styczeń",2018,"Styczeń"]
["2018-01-22","II",2451636,230,null,230,22,"Styczeń",2018,"Styczeń"]
["2018-01-22","II",787,280,null,280,22,"Styczeń",2018,"Styczeń"]
["2018-01-22","II",571,657,null,657,22,"Styczeń",2018,"Styczeń"]
["2018-01-22","III",791,160,null,{"$f":"IF(A384=\"\",\"\",D384+E384)","v":160},{"$f":"IF(A384=\"\",\"\",DAY(A384))","v":22},{"$f":"IFERROR(VLOOKUP(IF(A384=\"\",\"\",MONTH(A384)),$P$3:$Q$14,2,FALSE),\"\")","v":"Styczeń"},{"$f":"IF(A384=\"\",\"\",YEAR(A384))","v":2018},{"$f":"H384","v":"Styczeń"}]
["2018-01-22","III",787,87,13,100,22,"Styczeń",2018,"Styczeń"]
["2018-01-22","III",780,58,null,58,22,"Styczeń",2018,"Styczeń"]
["2018-01-22","III",26144994,1144,null,1144,22,"Styczeń",2018,"Styczeń"]
["2018-01-22","III",326,1198,null,1198,22,"Styczeń",2018,"Styczeń"]
["2018-01-22","III",575,271,null,271,22,"Styczeń",2018,"Styczeń"]
["2018-01-23","I",891,1600,null,{"$f":"IF(A390=\"\",\"\",D390+E390)","v":1600},{"$f":"IF(A390=\"\",\"\",DAY(A390))","v":23},{"$f":"IFERROR(VLOOKUP(IF(A390=\"\",\"\",MONTH(A390)),$P$3:$Q$14,2,FALSE),\"\")","v":"Styczeń"},{"$f":"IF(A390=\"\",\"\",YEAR(A390))","v":2018},{"$f":"H390","v":"Styczeń"}]
["2018-01-23","I",95,1000,null,1000,23,"Styczeń",2018,"Styczeń"]
["2018-01-23","I","300F",74,null,74,23,"Styczeń",2018,"Styczeń"]
["2018-01-23","I",326,588,null,588,23,"Styczeń",2018,"Styczeń"]
["2018-01-23","I",498,2386,2,2388,23,"Styczeń",2018,"Styczeń"]
["2018-01-23","I","721F",350,36,386,23,"Styczeń",2018,"Styczeń"]
["2018-01-23","I",2009613,20,null,20,23,"Styczeń",2018,"Styczeń"]
["2018-01-23","I",888,75,2,77,23,"Styczeń",2018,"Styczeń"]
["2018-01-23","I",513,75,null,75,23,"Styczeń",2018,"Styczeń"]
["2018-01-23","I",575,525,127,652,23,"Styczeń",2018,"Styczeń"]
["2018-01-23","I","717F",576,32,608,23,"Styczeń",2018,"Styczeń"]
["2018-01-23","II",944,10,null,{"$f":"IF(A401=\"\",\"\",D401+E401)","v":10},{"$f":"IF(A401=\"\",\"\",DAY(A401))","v":23},{"$f":"IFERROR(VLOOKUP(IF(A401=\"\",\"\",MONTH(A401)),$P$3:$Q$14,2,FALSE),\"\")","v":"Styczeń"},{"$f":"IF(A401=\"\",\"\",YEAR(A401))","v":2018},{"$f":"H401","v":"Styczeń"}]
["2018-01-23","II",799,16,null,16,23,"Styczeń",2018,"Styczeń"]
["2018-01-23","II",570,250,null,250,23,"Styczeń",2018,"Styczeń"]
["2018-01-23","II",2310044,480,null,480,23,"Styczeń",2018,"Styczeń"]
["2018-01-23","II",2297015,650,null,650,23,"Styczeń",2018,"Styczeń"]
["2018-01-23","III",179,933,null,933,23,"Styczeń",2018,"Styczeń"]
["2018-01-23","III",780,160,null,160,23,"Styczeń",2018,"Styczeń"]
["2018-01-23","III",933,150,null,150,23,"Styczeń",2018,"Styczeń"]
["2018-01-23","III",26144994,380,null,380,23,"Styczeń",2018,"Styczeń"]
["2018-01-23","III",326,1992,1,1993,23,"Styczeń",2018,"Styczeń"]
["2018-01-24","I","334F",1000,15,{"$f":"IF(A411=\"\",\"\",D411+E411)","v":1015},{"$f":"IF(A411=\"\",\"\",DAY(A411))","v":24},{"$f":"IFERROR(VLOOKUP(IF(A411=\"\",\"\",MONTH(A411)),$P$3:$Q$14,2,FALSE),\"\")","v":"Styczeń"},{"$f":"IF(A411=\"\",\"\",YEAR(A411))","v":2018},{"$f":"H411","v":"Styczeń"}]
["2018-01-24","I",2408708,168,null,168,24,"Styczeń",2018,"Styczeń"]
["2018-01-24","I",2435318,20,null,20,24,"Styczeń",2018,"Styczeń"]
["2018-01-24","I",1533713,33,null,33,24,"Styczeń",2018,"Styczeń"]
["2018-01-24","I","33501F",250,8,258,24,"Styczeń",2018,"Styczeń"]
["2018-01-24","I",799,10,null,10,24,"Styczeń",2018,"Styczeń"]
["2018-01-24","I",514,15,null,15,24,"Styczeń",2018,"Styczeń"]
["2018-01-24","I",1880156,83,21,104,24,"Styczeń",2018,"Styczeń"]
["2018-01-24","I",498,2997,null,2997,24,"Styczeń",2018,"Styczeń"]
["2018-01-24","I","717F",368,14,382,24,"Styczeń",2018,"Styczeń"]
["2018-01-24","II",996,27,null,{"$f":"IF(A421=\"\",\"\",D421+E421)","v":27},{"$f":"IF(A421=\"\",\"\",DAY(A421))","v":24},{"$f":"IFERROR(VLOOKUP(IF(A421=\"\",\"\",MONTH(A421)),$P$3:$Q$14,2,FALSE),\"\")","v":"Styczeń"},{"$f":"IF(A421=\"\",\"\",YEAR(A421))","v":2018},{"$f":"H421","v":"Styczeń"}]
["2018-01-24","II",1533713,23,null,23,24,"Styczeń",2018,"Styczeń"]
["2018-01-24","II",356,37,null,37,24,"Styczeń",2018,"Styczeń"]
["2018-01-24","II",787,255,null,255,24,"Styczeń",2018,"Styczeń"]
["2018-01-24","II",179,32,null,32,24,"Styczeń",2018,"Styczeń"]
["2018-01-24","II",160,229,null,229,24,"Styczeń",2018,"Styczeń"]
["2018-01-24","II",2432300,789,null,789,24,"Styczeń",2018,"Styczeń"]
["2018-01-24","II",844,80,null,80,24,"Styczeń",2018,"Styczeń"]
["2018-01-24","II",198,400,null,400,24,"Styczeń",2018,"Styczeń"]
["2018-01-24","II",543,9,null,9,24,"Styczeń",2018,"Styczeń"]
["2018-01-24","II",726,320,null,320,24,"Styczeń",2018,"Styczeń"]
["2018-01-24","II",891,320,null,320,24,"Styczeń",2018,"Styczeń"]
["2018-01-25","I","713F",120,4,{"$f":"IF(A433=\"\",\"\",D433+E433)","v":124},{"$f":"IF(A433=\"\",\"\",DAY(A433))","v":25},{"$f":"IFERROR(VLOOKUP(IF(A433=\"\",\"\",MONTH(A433)),$P$3:$Q$14,2,FALSE),\"\")","v":"Styczeń"},{"$f":"IF(A433=\"\",\"\",YEAR(A433))","v":2018},{"$f":"H433","v":"Styczeń"}]
["2018-01-25","I",933,300,null,300,25,"Styczeń",2018,"Styczeń"]
["2018-01-25","I",498,1599,null,1599,25,"Styczeń",2018,"Styczeń"]
["2018-01-25","I",26144994,41,null,41,25,"Styczeń",2018,"Styczeń"]
["2018-01-25","I",2067417,10,null,10,25,"Styczeń",2018,"Styczeń"]
["2018-01-25","I",416,10,null,10,25,"Styczeń",2018,"Styczeń"]
["2018-01-25","I",958,14,null,14,25,"Styczeń",2018,"Styczeń"]
["2018-01-25","I",414,10,null,10,25,"Styczeń",2018,"Styczeń"]
["2018-01-25","I",701,4,null,4,25,"Styczeń",2018,"Styczeń"]
["2018-01-25","I",162,6,null,6,25,"Styczeń",2018,"Styczeń"]
["2018-01-25","I","334F",1487,56,1543,25,"Styczeń",2018,"Styczeń"]
["2018-01-25","I",812,508,null,508,25,"Styczeń",2018,"Styczeń"]
["2018-01-25","I",97,60,null,60,25,"Styczeń",2018,"Styczeń"]
["2018-01-25","I","346F",120,null,120,25,"Styczeń",2018,"Styczeń"]
["2018-01-25","II",198,200,1,{"$f":"IF(A447=\"\",\"\",D447+E447)","v":201},{"$f":"IF(A447=\"\",\"\",DAY(A447))","v":25},{"$f":"IFERROR(VLOOKUP(IF(A447=\"\",\"\",MONTH(A447)),$P$3:$Q$14,2,FALSE),\"\")","v":"Styczeń"},{"$f":"IF(A447=\"\",\"\",YEAR(A447))","v":2018},{"$f":"H447","v":"Styczeń"}]
["2018-01-25","II",252,243,5,248,25,"Styczeń",2018,"Styczeń"]
["2018-01-25","II",358,600,8,608,25,"Styczeń",2018,"Styczeń"]
["2018-01-25","II",996,400,null,400,25,"Styczeń",2018,"Styczeń"]
["2018-01-25","II",761,80,20,100,25,"Styczeń",2018,"Styczeń"]
["2018-01-25","II",2310044,264,null,264,25,"Styczeń",2018,"Styczeń"]
["2018-01-25","II",2451635,360,null,360,25,"Styczeń",2018,"Styczeń"]
["2018-01-26","III",326,1994,1,{"$f":"IF(A454=\"\",\"\",D454+E454)","v":1995},{"$f":"IF(A454=\"\",\"\",DAY(A454))","v":26},{"$f":"IFERROR(VLOOKUP(IF(A454=\"\",\"\",MONTH(A454)),$P$3:$Q$14,2,FALSE),\"\")","v":"Styczeń"},{"$f":"IF(A454=\"\",\"\",YEAR(A454))","v":2018},{"$f":"H454","v":"Styczeń"}]
["2018-01-26","III",26144994,378,null,378,26,"Styczeń",2018,"Styczeń"]
["2018-01-26","III",498,1997,1,1998,26,"Styczeń",2018,"Styczeń"]
["2018-01-26","III",26144994,364,null,364,26,"Styczeń",2018,"Styczeń"]
["2018-01-26","II",845,20,null,20,26,"Styczeń",2018,"Styczeń"]
["2018-01-26","II",1533713,359,null,359,26,"Styczeń",2018,"Styczeń"]
["2018-01-26","II",2451636,480,null,480,26,"Styczeń",2018,"Styczeń"]
["2018-01-27","I",693,5133,null,{"$f":"IF(A461=\"\",\"\",D461+E461)","v":5133},{"$f":"IF(A461=\"\",\"\",DAY(A461))","v":27},{"$f":"IFERROR(VLOOKUP(IF(A461=\"\",\"\",MONTH(A461)),$P$3:$Q$14,2,FALSE),\"\")","v":"Styczeń"},{"$f":"IF(A461=\"\",\"\",YEAR(A461))","v":2018},{"$f":"H461","v":"Styczeń"}]
["2018-01-27","I","s122309",450,null,450,27,"Styczeń",2018,"Styczeń"]
["2018-01-27","I",634,400,88,488,27,"Styczeń",2018,"Styczeń"]
["2018-01-27","I",119,1000,3,1003,27,"Styczeń",2018,"Styczeń"]
["2018-01-27","I",76,388,null,388,27,"Styczeń",2018,"Styczeń"]
["2018-01-29","I","705F",28,null,28,29,"Styczeń",2018,"Styczeń"]
["2018-01-29","I",2297015,169,null,169,29,"Styczeń",2018,"Styczeń"]
["2018-01-29","I",1880156,24,null,24,29,"Styczeń",2018,"Styczeń"]
["2018-01-29","I",437,49,null,49,29,"Styczeń",2018,"Styczeń"]
["2018-01-29","I","717F",496,3,499,29,"Styczeń",2018,"Styczeń"]
["2018-01-29","I","722F",105,3,108,29,"Styczeń",2018,"Styczeń"]
["2018-01-29","I",2030723,2670,null,2670,29,"Styczeń",2018,"Styczeń"]
["2018-01-29","I",197,3,null,3,29,"Styczeń",2018,"Styczeń"]
["2018-01-29","I",502,84,null,84,29,"Styczeń",2018,"Styczeń"]
["2018-01-29","I",498,2790,null,2790,29,"Styczeń",2018,"Styczeń"]
["2018-01-29","I",2334641,288,76,364,29,"Styczeń",2018,"Styczeń"]
["2018-01-29","I",839,250,15,265,29,"Styczeń",2018,"Styczeń"]
["2018-01-29","II",198,400,9,{"$f":"IF(A478=\"\",\"\",D478+E478)","v":409},{"$f":"IF(A478=\"\",\"\",DAY(A478))","v":29},{"$f":"IFERROR(VLOOKUP(IF(A478=\"\",\"\",MONTH(A478)),$P$3:$Q$14,2,FALSE),\"\")","v":"Styczeń"},{"$f":"IF(A478=\"\",\"\",YEAR(A478))","v":2018},{"$f":"H478","v":"Styczeń"}]
["2018-01-29","II",746,40,null,40,29,"Styczeń",2018,"Styczeń"]
["2018-01-29","II",2418976,108,null,108,29,"Styczeń",2018,"Styczeń"]
["2018-01-29","II",2418977,72,null,72,29,"Styczeń",2018,"Styczeń"]
["2018-01-29","II",791,20,null,20,29,"Styczeń",2018,"Styczeń"]
["2018-01-29","II",2310044,552,null,552,29,"Styczeń",2018,"Styczeń"]
["2018-01-29","III",812,966,null,{"$f":"IF(A484=\"\",\"\",D484+E484)","v":966},{"$f":"IF(A484=\"\",\"\",DAY(A484))","v":29},{"$f":"IFERROR(VLOOKUP(IF(A484=\"\",\"\",MONTH(A484)),$P$3:$Q$14,2,FALSE),\"\")","v":"Styczeń"},{"$f":"IF(A484=\"\",\"\",YEAR(A484))","v":2018},{"$f":"H484","v":"Styczeń"}]
["2018-01-29","III",780,82,null,82,29,"Styczeń",2018,"Styczeń"]
["2018-01-29","III",791,140,null,140,29,"Styczeń",2018,"Styczeń"]
["2018-01-29","III",26144994,748,null,748,29,"Styczeń",2018,"Styczeń"]
["2018-01-29","III",326,1596,null,1596,29,"Styczeń",2018,"Styczeń"]
["2018-01-29","III",310,110,null,110,29,"Styczeń",2018,"Styczeń"]
["2018-01-30","I",2149709,131,null,{"$f":"IF(A490=\"\",\"\",D490+E490)","v":131},{"$f":"IF(A490=\"\",\"\",DAY(A490))","v":30},{"$f":"IFERROR(VLOOKUP(IF(A490=\"\",\"\",MONTH(A490)),$P$3:$Q$14,2,FALSE),\"\")","v":"Styczeń"},{"$f":"IF(A490=\"\",\"\",YEAR(A490))","v":2018},{"$f":"H490","v":"Styczeń"}]
["2018-01-30","I",2375097,96,null,96,30,"Styczeń",2018,"Styczeń"]
["2018-01-30","I",894,240,12,252,30,"Styczeń",2018,"Styczeń"]
["2018-01-30","I",2007977,220,null,220,30,"Styczeń",2018,"Styczeń"]
["2018-01-30","I",319,20,null,20,30,"Styczeń",2018,"Styczeń"]
["2018-01-30","I","716f",624,6,630,30,"Styczeń",2018,"Styczeń"]
["2018-01-30","I",1901726,19,null,19,30,"Styczeń",2018,"Styczeń"]
["2018-01-30","I","718F",30,null,30,30,"Styczeń",2018,"Styczeń"]
["2018-01-30","I",514,15,1,16,30,"Styczeń",2018,"Styczeń"]
["2018-01-30","I",701,4,null,4,30,"Styczeń",2018,"Styczeń"]
["2018-01-30","I",476,71,null,71,30,"Styczeń",2018,"Styczeń"]
["2018-01-30","I",2030723,500,null,500,30,"Styczeń",2018,"Styczeń"]
["2018-01-30","I",326,2872,null,2872,30,"Styczeń",2018,"Styczeń"]
["2018-01-30","II",617,2,null,{"$f":"IF(A503=\"\",\"\",D503+E503)","v":2},{"$f":"IF(A503=\"\",\"\",DAY(A503))","v":30},{"$f":"IFERROR(VLOOKUP(IF(A503=\"\",\"\",MONTH(A503)),$P$3:$Q$14,2,FALSE),\"\")","v":"Styczeń"},{"$f":"IF(A503=\"\",\"\",YEAR(A503))","v":2018},{"$f":"H503","v":"Styczeń"}]
["2018-01-30","II",437,245,12,257,30,"Styczeń",2018,"Styczeń"]
["2018-01-30","II",845,24,1,25,30,"Styczeń",2018,"Styczeń"]
["2018-01-30","II",179,911,null,911,30,"Styczeń",2018,"Styczeń"]
["2018-01-30","II",2296305,550,33,583,30,"Styczeń",2018,"Styczeń"]
["2018-01-30","III",514,180,32,212,30,"Styczeń",2018,"Styczeń"]
["2018-01-30","III",513,10,null,10,30,"Styczeń",2018,"Styczeń"]
["2018-01-30","III",356,400,4,404,30,"Styczeń",2018,"Styczeń"]
["2018-01-30","III",2432300,800,3,803,30,"Styczeń",2018,"Styczeń"]
["2018-01-30","III",933,250,null,250,30,"Styczeń",2018,"Styczeń"]
["2018-01-30","III",26144994,1131,null,1131,30,"Styczeń",2018,"Styczeń"]
["2018-01-30","III",498,1200,null,1200,30,"Styczeń",2018,"Styczeń"]
["2018-01-30","III",817,8,null,8,30,"Styczeń",2018,"Styczeń"]
["2018-01-31","I",701,4,null,{"$f":"IF(A516=\"\",\"\",D516+E516)","v":4},{"$f":"IF(A516=\"\",\"\",DAY(A516))","v":31},{"$f":"IFERROR(VLOOKUP(IF(A516=\"\",\"\",MONTH(A516)),$P$3:$Q$14,2,FALSE),\"\")","v":"Styczeń"},{"$f":"IF(A516=\"\",\"\",YEAR(A516))","v":2018},{"$f":"H516","v":"Styczeń"}]
["2018-01-31","I",560,88,null,88,31,"Styczeń",2018,"Styczeń"]
["2018-01-31","I",2334641,74,null,74,31,"Styczeń",2018,"Styczeń"]
["2018-01-31","I","721F",210,5,215,31,"Styczeń",2018,"Styczeń"]
["2018-01-31","I","33501F",250,null,250,31,"Styczeń",2018,"Styczeń"]
["2018-01-31","I",197,3,null,3,31,"Styczeń",2018,"Styczeń"]
["2018-01-31","I",2149709,24,null,24,31,"Styczeń",2018,"Styczeń"]
["2018-01-31","I",958,12,null,12,31,"Styczeń",2018,"Styczeń"]
["2018-01-31","I",554,10,null,10,31,"Styczeń",2018,"Styczeń"]
["2018-01-31","I","33501F",240,null,240,31,"Styczeń",2018,"Styczeń"]
["2018-01-31","I",498,2779,null,2779,31,"Styczeń",2018,"Styczeń"]
["2018-01-31","I",708,372,null,372,31,"Styczeń",2018,"Styczeń"]
["2018-01-31","I","33503F",130,null,130,31,"Styczeń",2018,"Styczeń"]
["2018-01-31","I",700,20,null,20,31,"Styczeń",2018,"Styczeń"]
["2018-01-31","I",702,15,null,15,31,"Styczeń",2018,"Styczeń"]
["2018-01-31","II","33505F",110,null,{"$f":"IF(A531=\"\",\"\",D531+E531)","v":110},{"$f":"IF(A531=\"\",\"\",DAY(A531))","v":31},{"$f":"IFERROR(VLOOKUP(IF(A531=\"\",\"\",MONTH(A531)),$P$3:$Q$14,2,FALSE),\"\")","v":"Styczeń"},{"$f":"IF(A531=\"\",\"\",YEAR(A531))","v":2018},{"$f":"H531","v":"Styczeń"}]
["2018-01-31","II",708,72,null,72,31,"Styczeń",2018,"Styczeń"]
["2018-01-31","II",202,192,11,203,31,"Styczeń",2018,"Styczeń"]
["2018-01-31","II",543,195,3,198,31,"Styczeń",2018,"Styczeń"]
["2018-01-31","II",31,123,1,124,31,"Styczeń",2018,"Styczeń"]
["2018-01-31","II",513,135,1,136,31,"Styczeń",2018,"Styczeń"]
["2018-01-31","II",119,360,12,372,31,"Styczeń",2018,"Styczeń"]
["2018-01-31","II",2451636,135,null,135,31,"Styczeń",2018,"Styczeń"]
["2018-01-31","II",787,462,null,462,31,"Styczeń",2018,"Styczeń"]
["2018-01-31","III",2408709,120,null,{"$f":"IF(A540=\"\",\"\",D540+E540)","v":120},{"$f":"IF(A540=\"\",\"\",DAY(A540))","v":31},{"$f":"IFERROR(VLOOKUP(IF(A540=\"\",\"\",MONTH(A540)),$P$3:$Q$14,2,FALSE),\"\")","v":"Styczeń"},{"$f":"IF(A540=\"\",\"\",YEAR(A540))","v":2018},{"$f":"H540","v":"Styczeń"}]
["2018-01-31","III",812,821,5,826,31,"Styczeń",2018,"Styczeń"]
["2018-01-31","III",2451636,405,2,407,31,"Styczeń",2018,"Styczeń"]
["2018-01-31","III",26144994,756,null,756,31,"Styczeń",2018,"Styczeń"]
["2018-01-31","III",326,1559,24,1583,31,"Styczeń",2018,"Styczeń"]
["2018-01-31","III",1745895,14,null,14,31,"Styczeń",2018,"Styczeń"]
["2018-01-31","III",2001994,18,null,18,31,"Styczeń",2018,"Styczeń"]
["2018-01-31","III",817,8,null,8,31,"Styczeń",2018,"Styczeń"]
["2018-02-01","I","722F",210,5,{"$f":"IF(A548=\"\",\"\",D548+E548)","v":215},{"$f":"IF(A548=\"\",\"\",DAY(A548))","v":1},{"$f":"IFERROR(VLOOKUP(IF(A548=\"\",\"\",MONTH(A548)),$P$3:$Q$14,2,FALSE),\"\")","v":"Luty"},{"$f":"IF(A548=\"\",\"\",YEAR(A548))","v":2018},{"$f":"H548","v":"Luty"}]
["2018-02-01","I","708F",312,18,330,1,"Luty",2018,"Luty"]
["2018-02-01","I",634,4,null,4,1,"Luty",2018,"Luty"]
["2018-02-01","I","711F",200,null,200,1,"Luty",2018,"Luty"]
["2018-02-01","I",15,468,null,468,1,"Luty",2018,"Luty"]
["2018-02-01","I","721F",144,4,148,1,"Luty",2018,"Luty"]
["2018-02-01","I",414,10,null,10,1,"Luty",2018,"Luty"]
["2018-02-01","I",318,20,null,20,1,"Luty",2018,"Luty"]
["2018-02-01","I",2494417,100,null,100,1,"Luty",2018,"Luty"]
["2018-02-01","I",326,2186,null,2186,1,"Luty",2018,"Luty"]
["2018-02-01","I",643,26,null,26,1,"Luty",2018,"Luty"]
["2018-02-01","I","33503F",552,null,552,1,"Luty",2018,"Luty"]
["2018-02-01","II",1533713,107,20,{"$f":"IF(A560=\"\",\"\",D560+E560)","v":127},{"$f":"IF(A560=\"\",\"\",DAY(A560))","v":1},{"$f":"IFERROR(VLOOKUP(IF(A560=\"\",\"\",MONTH(A560)),$P$3:$Q$14,2,FALSE),\"\")","v":"Luty"},{"$f":"IF(A560=\"\",\"\",YEAR(A560))","v":2018},{"$f":"H560","v":"Luty"}]
["2018-02-01","II",192,5,null,5,1,"Luty",2018,"Luty"]
["2018-02-01","II",198,500,null,500,1,"Luty",2018,"Luty"]
["2018-02-01","II",269,90,24,114,1,"Luty",2018,"Luty"]
["2018-02-01","II","33501F",232,6,238,1,"Luty",2018,"Luty"]
["2018-02-01","II",119,400,18,418,1,"Luty",2018,"Luty"]
["2018-02-01","II",358,78,19,97,1,"Luty",2018,"Luty"]
["2018-02-01","II",894,341,12,353,1,"Luty",2018,"Luty"]
["2018-02-01","III",498,2399,null,{"$f":"IF(A568=\"\",\"\",D568+E568)","v":2399},{"$f":"IF(A568=\"\",\"\",DAY(A568))","v":1},{"$f":"IFERROR(VLOOKUP(IF(A568=\"\",\"\",MONTH(A568)),$P$3:$Q$14,2,FALSE),\"\")","v":"Luty"},{"$f":"IF(A568=\"\",\"\",YEAR(A568))","v":2018},{"$f":"H568","v":"Luty"}]
["2018-02-01","III",1880156,236,50,286,1,"Luty",2018,"Luty"]
["2018-02-01","III",570,600,41,641,1,"Luty",2018,"Luty"]
["2018-02-01","III",212,20,null,20,1,"Luty",2018,"Luty"]
["2018-02-01","III",546,10,null,10,1,"Luty",2018,"Luty"]
["2018-02-01","III",761,173,108,281,1,"Luty",2018,"Luty"]
["2018-02-02","I","33503F",363,4,{"$f":"IF(A574=\"\",\"\",D574+E574)","v":367},{"$f":"IF(A574=\"\",\"\",DAY(A574))","v":2},{"$f":"IFERROR(VLOOKUP(IF(A574=\"\",\"\",MONTH(A574)),$P$3:$Q$14,2,FALSE),\"\")","v":"Luty"},{"$f":"IF(A574=\"\",\"\",YEAR(A574))","v":2018},{"$f":"H574","v":"Luty"}]
["2018-02-02","I",643,2,null,2,2,"Luty",2018,"Luty"]
["2018-02-02","I",2615043,8,null,8,2,"Luty",2018,"Luty"]
["2018-02-02","I","717F",673,2,675,2,"Luty",2018,"Luty"]
["2018-02-02","I",843,10,null,10,2,"Luty",2018,"Luty"]
["2018-02-02","I",242,105,null,105,2,"Luty",2018,"Luty"]
["2018-02-02","I",76,440,null,440,2,"Luty",2018,"Luty"]
["2018-02-02","I",888,15,null,15,2,"Luty",2018,"Luty"]
["2018-02-02","I",39,20,null,20,2,"Luty",2018,"Luty"]
["2018-02-02","I",467,20,null,20,2,"Luty",2018,"Luty"]
["2018-02-02","I",2126381,60,null,60,2,"Luty",2018,"Luty"]
["2018-02-02","I",701,27,null,27,2,"Luty",2018,"Luty"]
["2018-02-02","II",37,112,null,{"$f":"IF(A586=\"\",\"\",D586+E586)","v":112},{"$f":"IF(A586=\"\",\"\",DAY(A586))","v":2},{"$f":"IFERROR(VLOOKUP(IF(A586=\"\",\"\",MONTH(A586)),$P$3:$Q$14,2,FALSE),\"\")","v":"Luty"},{"$f":"IF(A586=\"\",\"\",YEAR(A586))","v":2018},{"$f":"H586","v":"Luty"}]
["2018-02-02","II",197,24,null,24,2,"Luty",2018,"Luty"]
["2018-02-02","II",76,448,null,448,2,"Luty",2018,"Luty"]
["2018-02-02","II",944,10,null,10,2,"Luty",2018,"Luty"]
["2018-02-02","II",2310044,552,null,552,2,"Luty",2018,"Luty"]
["2018-02-02","II",2296305,157,null,157,2,"Luty",2018,"Luty"]
["2018-02-02","II",76,440,null,440,2,"Luty",2018,"Luty"]
["2018-02-02","III",26144994,938,null,{"$f":"IF(A593=\"\",\"\",D593+E593)","v":938},{"$f":"IF(A593=\"\",\"\",DAY(A593))","v":2},{"$f":"IFERROR(VLOOKUP(IF(A593=\"\",\"\",MONTH(A593)),$P$3:$Q$14,2,FALSE),\"\")","v":"Luty"},{"$f":"IF(A593=\"\",\"\",YEAR(A593))","v":2018},{"$f":"H593","v":"Luty"}]
["2018-02-02","III",2510103,30,null,30,2,"Luty",2018,"Luty"]
["2018-02-02","III",498,1369,4,1373,2,"Luty",2018,"Luty"]
["2018-02-02","III",791,200,1,201,2,"Luty",2018,"Luty"]
["2018-02-05","I","800-569638-F",64,1,65,5,"Luty",2018,"Luty"]
["2018-02-05","I","33501F",240,2,242,5,"Luty",2018,"Luty"]
["2018-02-05","I","33503F",250,null,250,5,"Luty",2018,"Luty"]
["2018-02-05","I",415,10,null,10,5,"Luty",2018,"Luty"]
["2018-02-05","I",2067417,10,null,10,5,"Luty",2018,"Luty"]
["2018-02-05","I",307,20,null,20,5,"Luty",2018,"Luty"]
["2018-02-05","I","716F",347,107,454,5,"Luty",2018,"Luty"]
["2018-02-05","I","334F",13,null,13,5,"Luty",2018,"Luty"]
["2018-02-05","I","719F",129,1,130,5,"Luty",2018,"Luty"]
["2018-02-05","I",69,300,null,300,5,"Luty",2018,"Luty"]
["2018-02-05","I",26144994,372,null,372,5,"Luty",2018,"Luty"]
["2018-02-05","I",498,2035,null,2035,5,"Luty",2018,"Luty"]
["2018-02-05","II",101,218,null,{"$f":"IF(A609=\"\",\"\",D609+E609)","v":218},{"$f":"IF(A609=\"\",\"\",DAY(A609))","v":5},{"$f":"IFERROR(VLOOKUP(IF(A609=\"\",\"\",MONTH(A609)),$P$3:$Q$14,2,FALSE),\"\")","v":"Luty"},{"$f":"IF(A609=\"\",\"\",YEAR(A609))","v":2018},{"$f":"H609","v":"Luty"}]
["2018-02-05","II",198,400,null,400,5,"Luty",2018,"Luty"]
["2018-02-05","II",571,444,null,444,5,"Luty",2018,"Luty"]
["2018-02-05","II",2451635,300,null,300,5,"Luty",2018,"Luty"]
["2018-02-06","III",498,2396,null,2396,6,"Luty",2018,"Luty"]
["2018-02-06","I",482,10,null,10,6,"Luty",2018,"Luty"]
["2018-02-06","I","713F",103,19,122,6,"Luty",2018,"Luty"]
["2018-02-06","I","300F",140,null,140,6,"Luty",2018,"Luty"]
["2018-02-06","I",812,380,null,380,6,"Luty",2018,"Luty"]
["2018-02-06","I",575,275,7,282,6,"Luty",2018,"Luty"]
["2018-02-06","I",617,3,null,3,6,"Luty",2018,"Luty"]
["2018-02-06","I","721F",241,null,241,6,"Luty",2018,"Luty"]
["2018-02-06","I",2007977,20,null,20,6,"Luty",2018,"Luty"]
["2018-02-06","I",2113026,186,null,186,6,"Luty",2018,"Luty"]
["2018-02-06","I",593,40,null,40,6,"Luty",2018,"Luty"]
["2018-02-06","I",437,369,1,370,6,"Luty",2018,"Luty"]
["2018-02-06","I",498,1602,5,1607,6,"Luty",2018,"Luty"]
["2018-02-06","I",560,360,17,377,6,"Luty",2018,"Luty"]
["2018-02-06","I",787,105,null,105,6,"Luty",2018,"Luty"]
["2018-02-06","II",844,80,24,{"$f":"IF(A628=\"\",\"\",D628+E628)","v":104},{"$f":"IF(A628=\"\",\"\",DAY(A628))","v":6},{"$f":"IFERROR(VLOOKUP(IF(A628=\"\",\"\",MONTH(A628)),$P$3:$Q$14,2,FALSE),\"\")","v":"Luty"},{"$f":"IF(A628=\"\",\"\",YEAR(A628))","v":2018},{"$f":"H628","v":"Luty"}]
["2018-02-06","II",958,12,null,12,6,"Luty",2018,"Luty"]
["2018-02-06","II",160,355,null,355,6,"Luty",2018,"Luty"]
["2018-02-06","II",1901726,240,1,241,6,"Luty",2018,"Luty"]
["2018-02-06","II",2296305,500,2,502,6,"Luty",2018,"Luty"]
["2018-02-06","III",326,2333,12,2345,6,"Luty",2018,"Luty"]
["2018-02-07","I","33501F",18,null,{"$f":"IF(A634=\"\",\"\",D634+E634)","v":18},{"$f":"IF(A634=\"\",\"\",DAY(A634))","v":7},{"$f":"IFERROR(VLOOKUP(IF(A634=\"\",\"\",MONTH(A634)),$P$3:$Q$14,2,FALSE),\"\")","v":"Luty"},{"$f":"IF(A634=\"\",\"\",YEAR(A634))","v":2018},{"$f":"H634","v":"Luty"}]
["2018-02-07","I","300F",90,null,90,7,"Luty",2018,"Luty"]
["2018-02-07","I",2432300,1040,null,1040,7,"Luty",2018,"Luty"]
["2018-02-07","I",326,2937,1,2938,7,"Luty",2018,"Luty"]
["2018-02-07","I",839,177,8,185,7,"Luty",2018,"Luty"]
["2018-02-07","I",933,400,null,400,7,"Luty",2018,"Luty"]
["2018-02-07","I",431,324,null,324,7,"Luty",2018,"Luty"]
["2018-02-07","I",701,4,null,4,7,"Luty",2018,"Luty"]
["2018-02-07","II",41,60,null,{"$f":"IF(A642=\"\",\"\",D642+E642)","v":60},{"$f":"IF(A642=\"\",\"\",DAY(A642))","v":7},{"$f":"IFERROR(VLOOKUP(IF(A642=\"\",\"\",MONTH(A642)),$P$3:$Q$14,2,FALSE),\"\")","v":"Luty"},{"$f":"IF(A642=\"\",\"\",YEAR(A642))","v":2018},{"$f":"H642","v":"Luty"}]
["2018-02-07","II",2237976,256,null,256,7,"Luty",2018,"Luty"]
["2018-02-07","II",966,96,null,96,7,"Luty",2018,"Luty"]
["2018-02-07","II",845,36,null,36,7,"Luty",2018,"Luty"]
["2018-02-07","II",22,161,null,161,7,"Luty",2018,"Luty"]
["2018-02-07","II",2408708,384,6,390,7,"Luty",2018,"Luty"]
["2018-02-07","II",2007977,60,null,60,7,"Luty",2018,"Luty"]
["2018-02-07","III",498,2396,null,{"$f":"IF(A649=\"\",\"\",D649+E649)","v":2396},{"$f":"IF(A649=\"\",\"\",DAY(A649))","v":7},{"$f":"IFERROR(VLOOKUP(IF(A649=\"\",\"\",MONTH(A649)),$P$3:$Q$14,2,FALSE),\"\")","v":"Luty"},{"$f":"IF(A649=\"\",\"\",YEAR(A649))","v":2018},{"$f":"H649","v":"Luty"}]
["2018-02-08","I",2030723,800,null,800,8,"Luty",2018,"Luty"]
["2018-02-08","I","717f",191,null,191,8,"Luty",2018,"Luty"]
["2018-02-08","I",514,15,null,15,8,"Luty",2018,"Luty"]
["2018-02-08","I",179,845,null,845,8,"Luty",2018,"Luty"]
["2018-02-08","I",787,215,5,220,8,"Luty",2018,"Luty"]
["2018-02-08","I",554,10,null,10,8,"Luty",2018,"Luty"]
["2018-02-08","I",888,35,null,35,8,"Luty",2018,"Luty"]
["2018-02-08","I",341,12,null,12,8,"Luty",2018,"Luty"]
["2018-02-08","I",2035613,170,7,177,8,"Luty",2018,"Luty"]
["2018-02-08","I",498,2437,null,2437,8,"Luty",2018,"Luty"]
["2018-02-08","I",812,1120,null,1120,8,"Luty",2018,"Luty"]
["2018-02-08","I",634,345,null,345,8,"Luty",2018,"Luty"]
["2018-02-08","I",119,485,7,492,8,"Luty",2018,"Luty"]
["2018-02-08","II",896,25,null,{"$f":"IF(A663=\"\",\"\",D663+E663)","v":25},{"$f":"IF(A663=\"\",\"\",DAY(A663))","v":8},{"$f":"IFERROR(VLOOKUP(IF(A663=\"\",\"\",MONTH(A663)),$P$3:$Q$14,2,FALSE),\"\")","v":"Luty"},{"$f":"IF(A663=\"\",\"\",YEAR(A663))","v":2018},{"$f":"H663","v":"Luty"}]
["2018-02-08","II",554,10,null,10,8,"Luty",2018,"Luty"]
["2018-02-08","II",2494417,127,null,127,8,"Luty",2018,"Luty"]
["2018-02-08","II",776,3,null,3,8,"Luty",2018,"Luty"]
["2018-02-08","II",738,3,null,3,8,"Luty",2018,"Luty"]
["2018-02-08","II",2451635,210,2,212,8,"Luty",2018,"Luty"]
["2018-02-08","II",252,313,null,313,8,"Luty",2018,"Luty"]
["2018-02-08","III",498,2395,1,{"$f":"IF(A670=\"\",\"\",D670+E670)","v":2396},{"$f":"IF(A670=\"\",\"\",DAY(A670))","v":8},{"$f":"IFERROR(VLOOKUP(IF(A670=\"\",\"\",MONTH(A670)),$P$3:$Q$14,2,FALSE),\"\")","v":"Luty"},{"$f":"IF(A670=\"\",\"\",YEAR(A670))","v":2018},{"$f":"H670","v":"Luty"}]
["2018-02-09","I",677,51,null,51,9,"Luty",2018,"Luty"]
["2018-02-09","I","722F",70,5,75,9,"Luty",2018,"Luty"]
["2018-02-09","I","721F",280,5,285,9,"Luty",2018,"Luty"]
["2018-02-09","I","708F",88,2,90,9,"Luty",2018,"Luty"]
["2018-02-09","I",2451635,180,null,180,9,"Luty",2018,"Luty"]
["2018-02-09","I",570,310,20,330,9,"Luty",2018,"Luty"]
["2018-02-09","I",543,195,2,197,9,"Luty",2018,"Luty"]
["2018-02-09","I",162,21,null,21,9,"Luty",2018,"Luty"]
["2018-02-09","I",416,10,null,10,9,"Luty",2018,"Luty"]
["2018-02-09","I",31,160,null,160,9,"Luty",2018,"Luty"]
["2018-02-09","I",2001723,6,null,6,9,"Luty",2018,"Luty"]
["2018-02-09","I",498,2529,null,2529,9,"Luty",2018,"Luty"]
["2018-02-09","I","334F",1000,28,1028,9,"Luty",2018,"Luty"]
["2018-02-09","I",162,112,5,117,9,"Luty",2018,"Luty"]
["2018-02-09","II",894,40,140,{"$f":"IF(A685=\"\",\"\",D685+E685)","v":180},{"$f":"IF(A685=\"\",\"\",DAY(A685))","v":9},{"$f":"IFERROR(VLOOKUP(IF(A685=\"\",\"\",MONTH(A685)),$P$3:$Q$14,2,FALSE),\"\")","v":"Luty"},{"$f":"IF(A685=\"\",\"\",YEAR(A685))","v":2018},{"$f":"H685","v":"Luty"}]
["2018-02-09","II",1901726,120,null,120,9,"Luty",2018,"Luty"]
["2018-02-09","II",701,27,null,27,9,"Luty",2018,"Luty"]
["2018-02-09","II",2310044,600,null,600,9,"Luty",2018,"Luty"]
["2018-02-09","II",119,320,null,320,9,"Luty",2018,"Luty"]
["2018-02-09","III",498,1602,null,1602,9,"Luty",2018,"Luty"]
["2018-02-09","III",326,798,null,798,9,"Luty",2018,"Luty"]
["2018-02-10","I",701,4,null,{"$f":"IF(A692=\"\",\"\",D692+E692)","v":4},{"$f":"IF(A692=\"\",\"\",DAY(A692))","v":10},{"$f":"IFERROR(VLOOKUP(IF(A692=\"\",\"\",MONTH(A692)),$P$3:$Q$14,2,FALSE),\"\")","v":"Luty"},{"$f":"IF(A692=\"\",\"\",YEAR(A692))","v":2018},{"$f":"H692","v":"Luty"}]
["2018-02-10","I",513,55,null,55,10,"Luty",2018,"Luty"]
["2018-02-10","I",797,8,null,8,10,"Luty",2018,"Luty"]
["2018-02-10","I",817,16,null,16,10,"Luty",2018,"Luty"]
["2018-02-10","I",310,10,null,10,10,"Luty",2018,"Luty"]
["2018-02-10","I",812,850,31,881,10,"Luty",2018,"Luty"]
["2018-02-10","I",326,2771,18,2789,10,"Luty",2018,"Luty"]
["2018-02-12","I",812,216,1,{"$f":"IF(A699=\"\",\"\",D699+E699)","v":217},{"$f":"IF(A699=\"\",\"\",DAY(A699))","v":12},{"$f":"IFERROR(VLOOKUP(IF(A699=\"\",\"\",MONTH(A699)),$P$3:$Q$14,2,FALSE),\"\")","v":"Luty"},{"$f":"IF(A699=\"\",\"\",YEAR(A699))","v":2018},{"$f":"H699","v":"Luty"}]
["2018-02-12","I",2297015,182,null,182,12,"Luty",2018,"Luty"]
["2018-02-12","I",307,20,null,20,12,"Luty",2018,"Luty"]
["2018-02-12","I",562,30,null,30,12,"Luty",2018,"Luty"]
["2018-02-12","I",468,1,null,1,12,"Luty",2018,"Luty"]
["2018-02-12","I",482,1,null,1,12,"Luty",2018,"Luty"]
["2018-02-12","I",958,18,null,18,12,"Luty",2018,"Luty"]
["2018-02-12","I",917,3,null,3,12,"Luty",2018,"Luty"]
["2018-02-12","I",872,15,7,22,12,"Luty",2018,"Luty"]
["2018-02-12","I",415,10,null,10,12,"Luty",2018,"Luty"]
["2018-02-12","I",1919305,1,1,2,12,"Luty",2018,"Luty"]
["2018-02-12","I",593,40,null,40,12,"Luty",2018,"Luty"]
["2018-02-12","I",2149709,150,null,150,12,"Luty",2018,"Luty"]
["2018-02-12","I",498,1345,null,1345,12,"Luty",2018,"Luty"]
["2018-02-12","I",326,1799,1,1800,12,"Luty",2018,"Luty"]
["2018-02-12","I",634,530,46,576,12,"Luty",2018,"Luty"]
["2018-02-12","I","334F",1125,18,1143,12,"Luty",2018,"Luty"]
["2018-02-12","II",198,300,null,{"$f":"IF(A716=\"\",\"\",D716+E716)","v":300},{"$f":"IF(A716=\"\",\"\",DAY(A716))","v":12},{"$f":"IFERROR(VLOOKUP(IF(A716=\"\",\"\",MONTH(A716)),$P$3:$Q$14,2,FALSE),\"\")","v":"Luty"},{"$f":"IF(A716=\"\",\"\",YEAR(A716))","v":2018},{"$f":"H716","v":"Luty"}]
["2018-02-12","II",746,4,null,4,12,"Luty",2018,"Luty"]
["2018-02-12","II",693,3040,null,3040,12,"Luty",2018,"Luty"]
["2018-02-12","II",2297015,572,1,573,12,"Luty",2018,"Luty"]
["2018-02-12","II",791,16,null,16,12,"Luty",2018,"Luty"]
["2018-02-12","II",693,1200,null,1200,12,"Luty",2018,"Luty"]
["2018-02-12","III",326,2390,6,{"$f":"IF(A722=\"\",\"\",D722+E722)","v":2396},{"$f":"IF(A722=\"\",\"\",DAY(A722))","v":12},{"$f":"IFERROR(VLOOKUP(IF(A722=\"\",\"\",MONTH(A722)),$P$3:$Q$14,2,FALSE),\"\")","v":"Luty"},{"$f":"IF(A722=\"\",\"\",YEAR(A722))","v":2018},{"$f":"H722","v":"Luty"}]
["2018-02-13","I",2494417,133,13,146,13,"Luty",2018,"Luty"]
["2018-02-13","I",437,48,null,48,13,"Luty",2018,"Luty"]
["2018-02-13","I",416,10,null,10,13,"Luty",2018,"Luty"]
["2018-02-13","I","716F",722,14,736,13,"Luty",2018,"Luty"]
["2018-02-13","I",634,393,15,408,13,"Luty",2018,"Luty"]
["2018-02-13","I",894,80,null,80,13,"Luty",2018,"Luty"]
["2018-02-13","I",2296305,513,null,513,13,"Luty",2018,"Luty"]
["2018-02-13","I",326,3130,null,3130,13,"Luty",2018,"Luty"]
["2018-02-13","I",593,40,null,40,13,"Luty",2018,"Luty"]
["2018-02-13","I",1533713,264,null,264,13,"Luty",2018,"Luty"]
["2018-02-13","I","717F",607,20,627,13,"Luty",2018,"Luty"]
["2018-02-13","II",772,10,null,{"$f":"IF(A734=\"\",\"\",D734+E734)","v":10},{"$f":"IF(A734=\"\",\"\",DAY(A734))","v":13},{"$f":"IFERROR(VLOOKUP(IF(A734=\"\",\"\",MONTH(A734)),$P$3:$Q$14,2,FALSE),\"\")","v":"Luty"},{"$f":"IF(A734=\"\",\"\",YEAR(A734))","v":2018},{"$f":"H734","v":"Luty"}]
["2018-02-13","II",617,2,null,2,13,"Luty",2018,"Luty"]
["2018-02-13","II",839,163,7,170,13,"Luty",2018,"Luty"]
["2018-02-13","II",2035613,271,16,287,13,"Luty",2018,"Luty"]
["2018-02-13","II",2451635,510,3,513,13,"Luty",2018,"Luty"]
["2018-02-13","II",575,337,12,349,13,"Luty",2018,"Luty"]
["2018-02-13","II",772,10,null,{"$f":"IF(A740=\"\",\"\",D740+E740)","v":10},{"$f":"IF(A740=\"\",\"\",DAY(A740))","v":13},{"$f":"IFERROR(VLOOKUP(IF(A740=\"\",\"\",MONTH(A740)),$P$3:$Q$14,2,FALSE),\"\")","v":"Luty"},{"$f":"IF(A740=\"\",\"\",YEAR(A740))","v":2018},{"$f":"H740","v":"Luty"}]
["2018-02-13","II",617,2,null,2,13,"Luty",2018,"Luty"]
["2018-02-13","II",839,163,7,170,13,"Luty",2018,"Luty"]
["2018-02-13","II",2035613,271,16,287,13,"Luty",2018,"Luty"]
["2018-02-13","II",2451635,510,3,513,13,"Luty",2018,"Luty"]
["2018-02-13","II",575,337,12,349,13,"Luty",2018,"Luty"]
["2018-02-13","III",498,2192,null,{"$f":"IF(A746=\"\",\"\",D746+E746)","v":2192},{"$f":"IF(A746=\"\",\"\",DAY(A746))","v":13},{"$f":"IFERROR(VLOOKUP(IF(A746=\"\",\"\",MONTH(A746)),$P$3:$Q$14,2,FALSE),\"\")","v":"Luty"},{"$f":"IF(A746=\"\",\"\",YEAR(A746))","v":2018},{"$f":"H746","v":"Luty"}]
["2018-02-13","III",326,200,null,200,13,"Luty",2018,"Luty"]
["2018-02-14","I","33501F",479,2,481,14,"Luty",2018,"Luty"]
["2018-02-14","I",418,10,null,10,14,"Luty",2018,"Luty"]
["2018-02-14","I","334F",874,null,874,14,"Luty",2018,"Luty"]
["2018-02-14","I",48,2,null,2,14,"Luty",2018,"Luty"]
["2018-02-14","I","802F",20,null,20,14,"Luty",2018,"Luty"]
["2018-02-14","I",479,6,null,6,14,"Luty",2018,"Luty"]
["2018-02-14","I",326,3382,null,3382,14,"Luty",2018,"Luty"]
["2018-02-14","I",498,200,null,200,14,"Luty",2018,"Luty"]
["2018-02-14","I",437,420,null,420,14,"Luty",2018,"Luty"]
["2018-02-14","I",2310044,552,null,552,14,"Luty",2018,"Luty"]
["2018-02-14","II",844,80,null,{"$f":"IF(A758=\"\",\"\",D758+E758)","v":80},{"$f":"IF(A758=\"\",\"\",DAY(A758))","v":14},{"$f":"IFERROR(VLOOKUP(IF(A758=\"\",\"\",MONTH(A758)),$P$3:$Q$14,2,FALSE),\"\")","v":"Luty"},{"$f":"IF(A758=\"\",\"\",YEAR(A758))","v":2018},{"$f":"H758","v":"Luty"}]
["2018-02-14","II",119,360,10,370,14,"Luty",2018,"Luty"]
["2018-02-14","II",2451636,290,null,290,14,"Luty",2018,"Luty"]
["2018-02-14","III",498,1198,null,1198,14,"Luty",2018,"Luty"]
["2018-02-14","III",160,14,null,14,14,"Luty",2018,"Luty"]
["2018-02-14","III",1901726,324,null,324,14,"Luty",2018,"Luty"]
["2018-02-14","III",310,30,null,30,14,"Luty",2018,"Luty"]
["2018-02-14","III",2001994,27,null,27,14,"Luty",2018,"Luty"]
["2018-02-15","I",787,140,null,{"$f":"IF(A766=\"\",\"\",D766+E766)","v":140},{"$f":"IF(A766=\"\",\"\",DAY(A766))","v":15},{"$f":"IFERROR(VLOOKUP(IF(A766=\"\",\"\",MONTH(A766)),$P$3:$Q$14,2,FALSE),\"\")","v":"Luty"},{"$f":"IF(A766=\"\",\"\",YEAR(A766))","v":2018},{"$f":"H766","v":"Luty"}]
["2018-02-15","I",894,99,null,99,15,"Luty",2018,"Luty"]
["2018-02-15","I",812,184,null,184,15,"Luty",2018,"Luty"]
["2018-02-15","I","717F",258,10,268,15,"Luty",2018,"Luty"]
["2018-02-15","I","33503F",85,null,85,15,"Luty",2018,"Luty"]
["2018-02-15","I",1879620,39,null,39,15,"Luty",2018,"Luty"]
["2018-02-15","I",2408708,384,null,384,15,"Luty",2018,"Luty"]
["2018-02-15","I",498,1792,null,1792,15,"Luty",2018,"Luty"]
["2018-02-15","I",326,199,null,199,15,"Luty",2018,"Luty"]
["2018-02-15","I",119,200,null,200,15,"Luty",2018,"Luty"]
["2018-02-15","I",933,425,null,425,15,"Luty",2018,"Luty"]
["2018-02-15","II",746,36,null,{"$f":"IF(A777=\"\",\"\",D777+E777)","v":36},{"$f":"IF(A777=\"\",\"\",DAY(A777))","v":15},{"$f":"IFERROR(VLOOKUP(IF(A777=\"\",\"\",MONTH(A777)),$P$3:$Q$14,2,FALSE),\"\")","v":"Luty"},{"$f":"IF(A777=\"\",\"\",YEAR(A777))","v":2018},{"$f":"H777","v":"Luty"}]
["2018-02-15","II",166,10,null,10,15,"Luty",2018,"Luty"]
["2018-02-15","II",495,10,9,19,15,"Luty",2018,"Luty"]
["2018-02-15","II",2408709,120,null,120,15,"Luty",2018,"Luty"]
["2018-02-15","II",160,196,null,196,15,"Luty",2018,"Luty"]
["2018-02-15","II",202,192,13,205,15,"Luty",2018,"Luty"]
["2018-02-15","II",119,600,9,609,15,"Luty",2018,"Luty"]
["2018-02-15","II",791,140,null,140,15,"Luty",2018,"Luty"]
["2018-02-16","I","346F",400,26,{"$f":"IF(A785=\"\",\"\",D785+E785)","v":426},{"$f":"IF(A785=\"\",\"\",DAY(A785))","v":16},{"$f":"IFERROR(VLOOKUP(IF(A785=\"\",\"\",MONTH(A785)),$P$3:$Q$14,2,FALSE),\"\")","v":"Luty"},{"$f":"IF(A785=\"\",\"\",YEAR(A785))","v":2018},{"$f":"H785","v":"Luty"}]
["2018-02-16","I",2334641,360,26,386,16,"Luty",2018,"Luty"]
["2018-02-16","I",996,402,null,402,16,"Luty",2018,"Luty"]
["2018-02-16","I",871,5,null,5,16,"Luty",2018,"Luty"]
["2018-02-16","I",593,80,null,80,16,"Luty",2018,"Luty"]
["2018-02-16","I",319,40,null,40,16,"Luty",2018,"Luty"]
["2018-02-16","I",1901726,120,null,120,16,"Luty",2018,"Luty"]
["2018-02-16","I",498,2796,22,2818,16,"Luty",2018,"Luty"]
["2018-02-16","I",356,150,22,172,16,"Luty",2018,"Luty"]
["2018-02-16","I",2297015,234,null,234,16,"Luty",2018,"Luty"]
["2018-02-16","I",69,206,null,206,16,"Luty",2018,"Luty"]
["2018-02-16","I",701,8,null,8,16,"Luty",2018,"Luty"]
["2018-02-16","II",358,16,null,{"$f":"IF(A797=\"\",\"\",D797+E797)","v":16},{"$f":"IF(A797=\"\",\"\",DAY(A797))","v":16},{"$f":"IFERROR(VLOOKUP(IF(A797=\"\",\"\",MONTH(A797)),$P$3:$Q$14,2,FALSE),\"\")","v":"Luty"},{"$f":"IF(A797=\"\",\"\",YEAR(A797))","v":2018},{"$f":"H797","v":"Luty"}]
["2018-02-16","II",702,27,null,27,16,"Luty",2018,"Luty"]
["2018-02-16","II","300F",90,12,102,16,"Luty",2018,"Luty"]
["2018-02-16","II","33505F",10,null,10,16,"Luty",2018,"Luty"]
["2018-02-16","II",2418977,133,17,150,16,"Luty",2018,"Luty"]
["2018-02-16","II","S122309",600,null,600,16,"Luty",2018,"Luty"]
["2018-02-16","II",2418976,123,null,123,16,"Luty",2018,"Luty"]
["2018-02-16","II",894,172,15,187,16,"Luty",2018,"Luty"]
["2018-02-16","II",119,165,5,170,16,"Luty",2018,"Luty"]
["2018-02-16","II",269,161,6,167,16,"Luty",2018,"Luty"]
["2018-02-16","II",2001994,18,null,18,16,"Luty",2018,"Luty"]
["2018-02-16","II",310,20,null,20,16,"Luty",2018,"Luty"]
["2018-02-16","II",546,10,null,10,16,"Luty",2018,"Luty"]
["2018-02-17","I","717F",393,32,{"$f":"IF(A810=\"\",\"\",D810+E810)","v":425},{"$f":"IF(A810=\"\",\"\",DAY(A810))","v":17},{"$f":"IFERROR(VLOOKUP(IF(A810=\"\",\"\",MONTH(A810)),$P$3:$Q$14,2,FALSE),\"\")","v":"Luty"},{"$f":"IF(A810=\"\",\"\",YEAR(A810))","v":2018},{"$f":"H810","v":"Luty"}]
["2018-02-17","I",69,68,null,68,17,"Luty",2018,"Luty"]
["2018-02-17","I","33501F",21,null,21,17,"Luty",2018,"Luty"]
["2018-02-17","I","802F",147,8,155,17,"Luty",2018,"Luty"]
["2018-02-17","I",894,157,null,157,17,"Luty",2018,"Luty"]
["2018-02-17","I",514,15,null,15,17,"Luty",2018,"Luty"]
["2018-02-17","I",571,596,null,596,17,"Luty",2018,"Luty"]
["2018-02-17","I",119,280,35,315,17,"Luty",2018,"Luty"]
["2018-02-19","I",391,20,null,{"$f":"IF(A818=\"\",\"\",D818+E818)","v":20},{"$f":"IF(A818=\"\",\"\",DAY(A818))","v":19},{"$f":"IFERROR(VLOOKUP(IF(A818=\"\",\"\",MONTH(A818)),$P$3:$Q$14,2,FALSE),\"\")","v":"Luty"},{"$f":"IF(A818=\"\",\"\",YEAR(A818))","v":2018},{"$f":"H818","v":"Luty"}]
["2018-02-19","I",2297015,3,null,3,19,"Luty",2018,"Luty"]
["2018-02-19","I",269,6,null,6,19,"Luty",2018,"Luty"]
["2018-02-19","I",1901726,17,null,17,19,"Luty",2018,"Luty"]
["2018-02-19","I",843,2,null,2,19,"Luty",2018,"Luty"]
["2018-02-19","I",467,1,null,1,19,"Luty",2018,"Luty"]
["2018-02-19","I",378,2,null,2,19,"Luty",2018,"Luty"]
["2018-02-19","I",2334641,26,null,26,19,"Luty",2018,"Luty"]
["2018-02-19","I",2001726,5,null,5,19,"Luty",2018,"Luty"]
["2018-02-19","I",326,2992,3,2995,19,"Luty",2018,"Luty"]
["2018-02-19","I",2451636,250,null,250,19,"Luty",2018,"Luty"]
["2018-02-19","I",76,729,null,729,19,"Luty",2018,"Luty"]
["2018-02-19","II","702f",400,35,{"$f":"IF(A830=\"\",\"\",D830+E830)","v":435},{"$f":"IF(A830=\"\",\"\",DAY(A830))","v":19},{"$f":"IFERROR(VLOOKUP(IF(A830=\"\",\"\",MONTH(A830)),$P$3:$Q$14,2,FALSE),\"\")","v":"Luty"},{"$f":"IF(A830=\"\",\"\",YEAR(A830))","v":2018},{"$f":"H830","v":"Luty"}]
["2018-02-19","II",554,10,null,10,19,"Luty",2018,"Luty"]
["2018-02-19","II","708f",400,1,401,19,"Luty",2018,"Luty"]
["2018-02-19","II","33501F",370,null,370,19,"Luty",2018,"Luty"]
["2018-02-19","II",570,600,null,600,19,"Luty",2018,"Luty"]
["2018-02-19","II",212,10,null,10,19,"Luty",2018,"Luty"]
["2018-02-19","II",2001994,9,null,9,19,"Luty",2018,"Luty"]
["2018-02-19","II",21,20,null,20,19,"Luty",2018,"Luty"]
["2018-02-19","III",498,2386,4,{"$f":"IF(A838=\"\",\"\",D838+E838)","v":2390},{"$f":"IF(A838=\"\",\"\",DAY(A838))","v":19},{"$f":"IFERROR(VLOOKUP(IF(A838=\"\",\"\",MONTH(A838)),$P$3:$Q$14,2,FALSE),\"\")","v":"Luty"},{"$f":"IF(A838=\"\",\"\",YEAR(A838))","v":2018},{"$f":"H838","v":"Luty"}]
["2018-02-19","III",2126381,5,null,5,19,"Luty",2018,"Luty"]
["2018-02-19","III",2310044,576,null,576,19,"Luty",2018,"Luty"]
["2018-02-20","I","33501F",130,null,130,20,"Luty",2018,"Luty"]
["2018-02-20","I","717F",480,21,501,20,"Luty",2018,"Luty"]
["2018-02-20","I","33505F",120,null,120,20,"Luty",2018,"Luty"]
["2018-02-20","I",22,200,1,201,20,"Luty",2018,"Luty"]
["2018-02-20","I",437,96,null,96,20,"Luty",2018,"Luty"]
["2018-02-20","I",701,27,null,27,20,"Luty",2018,"Luty"]
["2018-02-20","I",310,10,null,10,20,"Luty",2018,"Luty"]
["2018-02-20","I",2001994,18,null,18,20,"Luty",2018,"Luty"]
["2018-02-20","I",546,10,null,10,20,"Luty",2018,"Luty"]
["2018-02-20","I",2203172,10,null,10,20,"Luty",2018,"Luty"]
["2018-02-20","I",498,2406,null,2406,20,"Luty",2018,"Luty"]
["2018-02-20","I","721F",245,6,251,20,"Luty",2018,"Luty"]
["2018-02-20","I",2432300,400,null,400,20,"Luty",2018,"Luty"]
["2018-02-20","II",2432300,400,null,{"$f":"IF(A854=\"\",\"\",D854+E854)","v":400},{"$f":"IF(A854=\"\",\"\",DAY(A854))","v":20},{"$f":"IFERROR(VLOOKUP(IF(A854=\"\",\"\",MONTH(A854)),$P$3:$Q$14,2,FALSE),\"\")","v":"Luty"},{"$f":"IF(A854=\"\",\"\",YEAR(A854))","v":2018},{"$f":"H854","v":"Luty"}]
["2018-02-20","II",1533713,43,null,43,20,"Luty",2018,"Luty"]
["2018-02-20","II",560,448,null,448,20,"Luty",2018,"Luty"]
["2018-02-20","II",2149709,60,null,60,20,"Luty",2018,"Luty"]
["2018-02-20","III",198,400,null,400,20,"Luty",2018,"Luty"]
["2018-02-20","III",845,20,null,20,20,"Luty",2018,"Luty"]
["2018-02-20","III",179,382,3,385,20,"Luty",2018,"Luty"]
["2018-02-20","III",498,2383,2,2385,20,"Luty",2018,"Luty"]
["2018-02-20","III",310,20,null,20,20,"Luty",2018,"Luty"]
["2018-02-21","I","717F",4,null,{"$f":"IF(A863=\"\",\"\",D863+E863)","v":4},{"$f":"IF(A863=\"\",\"\",DAY(A863))","v":21},{"$f":"IFERROR(VLOOKUP(IF(A863=\"\",\"\",MONTH(A863)),$P$3:$Q$14,2,FALSE),\"\")","v":"Luty"},{"$f":"IF(A863=\"\",\"\",YEAR(A863))","v":2018},{"$f":"H863","v":"Luty"}]
["2018-02-21","I","33503F",454,null,454,21,"Luty",2018,"Luty"]
["2018-02-21","I",570,61,null,61,21,"Luty",2018,"Luty"]
["2018-02-21","I",2067417,10,null,10,21,"Luty",2018,"Luty"]
["2018-02-21","I",418,10,null,10,21,"Luty",2018,"Luty"]
["2018-02-21","I",179,656,null,656,21,"Luty",2018,"Luty"]
["2018-02-21","I","33501F",525,4,529,21,"Luty",2018,"Luty"]
["2018-02-21","I",702,54,null,54,21,"Luty",2018,"Luty"]
["2018-02-21","I",319,20,null,20,21,"Luty",2018,"Luty"]
["2018-02-21","I",2451636,30,null,30,21,"Luty",2018,"Luty"]
["2018-02-21","I",780,20,null,20,21,"Luty",2018,"Luty"]
["2018-02-21","I",414,10,null,10,21,"Luty",2018,"Luty"]
["2018-02-21","I",958,36,null,36,21,"Luty",2018,"Luty"]
["2018-02-21","I",326,2810,2,2812,21,"Luty",2018,"Luty"]
["2018-02-21","I",872,45,null,45,21,"Luty",2018,"Luty"]
["2018-02-21","I",2296305,300,null,300,21,"Luty",2018,"Luty"]
["2018-02-21","III",198,400,null,400,21,"Luty",2018,"Luty"]
["2018-02-21","III",845,20,null,20,21,"Luty",2018,"Luty"]
["2018-02-21","III",179,382,3,385,21,"Luty",2018,"Luty"]
["2018-02-21","III",498,2383,2,2385,21,"Luty",2018,"Luty"]
["2018-02-21","III",310,20,null,20,21,"Luty",2018,"Luty"]
["2018-02-21","III",31,239,null,{"$f":"IF(A884=\"\",\"\",D884+E884)","v":239},{"$f":"IF(A884=\"\",\"\",DAY(A884))","v":21},{"$f":"IFERROR(VLOOKUP(IF(A884=\"\",\"\",MONTH(A884)),$P$3:$Q$14,2,FALSE),\"\")","v":"Luty"},{"$f":"IF(A884=\"\",\"\",YEAR(A884))","v":2018},{"$f":"H884","v":"Luty"}]
["2018-02-21","III",780,200,null,200,21,"Luty",2018,"Luty"]
["2018-02-21","III",498,2457,5,2462,21,"Luty",2018,"Luty"]
["2018-02-22","II",2126381,60,null,60,22,"Luty",2018,"Luty"]
["2018-02-22","II",617,6,null,6,22,"Luty",2018,"Luty"]
["2018-02-22","II",616,6,null,6,22,"Luty",2018,"Luty"]
["2018-02-22","II",142,72,null,72,22,"Luty",2018,"Luty"]
["2018-02-22","II",101,200,null,200,22,"Luty",2018,"Luty"]
["2018-02-22","II",2297015,234,null,234,22,"Luty",2018,"Luty"]
["2018-02-22","III",839,167,18,{"$f":"IF(A893=\"\",\"\",D893+E893)","v":185},{"$f":"IF(A893=\"\",\"\",DAY(A893))","v":22},{"$f":"IFERROR(VLOOKUP(IF(A893=\"\",\"\",MONTH(A893)),$P$3:$Q$14,2,FALSE),\"\")","v":"Luty"},{"$f":"IF(A893=\"\",\"\",YEAR(A893))","v":2018},{"$f":"H893","v":"Luty"}]
["2018-02-22","III",2451635,120,null,120,22,"Luty",2018,"Luty"]
["2018-02-22","III",310,20,null,20,22,"Luty",2018,"Luty"]
["2018-02-22","III",212,20,null,20,22,"Luty",2018,"Luty"]
["2018-02-22","III",326,2411,1,2412,22,"Luty",2018,"Luty"]
["2018-02-23","I","300F",150,1,151,23,"Luty",2018,"Luty"]
["2018-02-23","I","717F",519,15,534,23,"Luty",2018,"Luty"]
["2018-02-23","I",2067417,10,null,10,23,"Luty",2018,"Luty"]
["2018-02-23","I",2001723,6,null,6,23,"Luty",2018,"Luty"]
["2018-02-23","I",2451635,18,null,18,23,"Luty",2018,"Luty"]
["2018-02-23","I",2297015,450,null,450,23,"Luty",2018,"Luty"]
["2018-02-23","I",2030723,100,null,100,23,"Luty",2018,"Luty"]
["2018-02-23","I",160,11,null,11,23,"Luty",2018,"Luty"]
["2018-02-23","I",543,150,1,151,23,"Luty",2018,"Luty"]
["2018-02-23","I",326,2979,null,2979,23,"Luty",2018,"Luty"]
["2018-02-23","I",812,700,26,726,23,"Luty",2018,"Luty"]
["2018-02-23","I",2149709,160,null,160,23,"Luty",2018,"Luty"]
["2018-02-23","I",119,80,null,80,23,"Luty",2018,"Luty"]
["2018-02-23","I","300F",150,1,{"$f":"IF(A911=\"\",\"\",D911+E911)","v":151},{"$f":"IF(A911=\"\",\"\",DAY(A911))","v":23},{"$f":"IFERROR(VLOOKUP(IF(A911=\"\",\"\",MONTH(A911)),$P$3:$Q$14,2,FALSE),\"\")","v":"Luty"},{"$f":"IF(A911=\"\",\"\",YEAR(A911))","v":2018},{"$f":"H911","v":"Luty"}]
["2018-02-23","I","717F",519,15,534,23,"Luty",2018,"Luty"]
["2018-02-23","I",2067417,10,null,10,23,"Luty",2018,"Luty"]
["2018-02-23","I",2001723,6,null,6,23,"Luty",2018,"Luty"]
["2018-02-23","I",2451635,18,null,18,23,"Luty",2018,"Luty"]
["2018-02-23","I",2297015,450,null,450,23,"Luty",2018,"Luty"]
["2018-02-23","I",2030723,100,null,100,23,"Luty",2018,"Luty"]
["2018-02-23","I",160,11,null,11,23,"Luty",2018,"Luty"]
["2018-02-23","I",543,150,1,151,23,"Luty",2018,"Luty"]
["2018-02-23","I",326,2979,null,2979,23,"Luty",2018,"Luty"]
["2018-02-23","I",812,700,26,726,23,"Luty",2018,"Luty"]
["2018-02-23","I",2149709,160,null,160,23,"Luty",2018,"Luty"]
["2018-02-23","I",119,80,null,80,23,"Luty",2018,"Luty"]
["2018-02-23","III",48,10,null,10,23,"Luty",2018,"Luty"]
["2018-02-23","III",47,30,null,30,23,"Luty",2018,"Luty"]
["2018-02-23","III",894,189,2,191,23,"Luty",2018,"Luty"]
["2018-02-23","III",933,125,null,125,23,"Luty",2018,"Luty"]
["2018-02-23","III",498,2365,1,2366,23,"Luty",2018,"Luty"]
["2018-02-23","III",1745895,28,null,28,23,"Luty",2018,"Luty"]
["2018-02-23","III",845,20,null,20,23,"Luty",2018,"Luty"]
["2018-02-24","I",1533713,222,null,{"$f":"IF(A931=\"\",\"\",D931+E931)","v":222},{"$f":"IF(A931=\"\",\"\",DAY(A931))","v":24},{"$f":"IFERROR(VLOOKUP(IF(A931=\"\",\"\",MONTH(A931)),$P$3:$Q$14,2,FALSE),\"\")","v":"Luty"},{"$f":"IF(A931=\"\",\"\",YEAR(A931))","v":2018},{"$f":"H931","v":"Luty"}]
["2018-02-24","I",76,44,null,44,24,"Luty",2018,"Luty"]
["2018-02-24","I",119,360,3,363,24,"Luty",2018,"Luty"]
["2018-02-24","I","s122309",150,null,150,24,"Luty",2018,"Luty"]
["2018-02-26","I",839,50,null,50,26,"Luty",2018,"Luty"]
["2018-02-26","I",560,16,null,16,26,"Luty",2018,"Luty"]
["2018-02-26","I",575,28,null,28,26,"Luty",2018,"Luty"]
["2018-02-26","I",2035613,21,null,21,26,"Luty",2018,"Luty"]
["2018-02-26","I",2297015,21,null,21,26,"Luty",2018,"Luty"]
["2018-02-26","I","717F",496,24,520,26,"Luty",2018,"Luty"]
["2018-02-26","I",416,10,null,10,26,"Luty",2018,"Luty"]
["2018-02-26","I",958,3,null,3,26,"Luty",2018,"Luty"]
["2018-02-26","I","716F",425,4,429,26,"Luty",2018,"Luty"]
["2018-02-26","I",2001723,6,null,6,26,"Luty",2018,"Luty"]
["2018-02-26","I",25,73,null,73,26,"Luty",2018,"Luty"]
["2018-02-26","I",871,10,null,10,26,"Luty",2018,"Luty"]
["2018-02-26","I",469,199,null,199,26,"Luty",2018,"Luty"]
["2018-02-26","I",326,2699,16,2715,26,"Luty",2018,"Luty"]
["2018-02-26","I",514,69,2,71,26,"Luty",2018,"Luty"]
["2018-02-26","I",76,572,2,574,26,"Luty",2018,"Luty"]
["2018-02-26","I",2408708,432,1,433,26,"Luty",2018,"Luty"]
["2018-02-26","II",37,20,null,{"$f":"IF(A952=\"\",\"\",D952+E952)","v":20},{"$f":"IF(A952=\"\",\"\",DAY(A952))","v":26},{"$f":"IFERROR(VLOOKUP(IF(A952=\"\",\"\",MONTH(A952)),$P$3:$Q$14,2,FALSE),\"\")","v":"Luty"},{"$f":"IF(A952=\"\",\"\",YEAR(A952))","v":2018},{"$f":"H952","v":"Luty"}]
["2018-02-26","II",160,24,null,24,26,"Luty",2018,"Luty"]
["2018-02-26","II","33501F",225,null,225,26,"Luty",2018,"Luty"]
["2018-02-26","II","33505F",120,null,120,26,"Luty",2018,"Luty"]
["2018-02-26","II","722F",105,1,106,26,"Luty",2018,"Luty"]
["2018-02-26","II",787,490,27,517,26,"Luty",2018,"Luty"]
["2018-02-26","I",839,50,null,{"$f":"IF(A958=\"\",\"\",D958+E958)","v":50},{"$f":"IF(A958=\"\",\"\",DAY(A958))","v":26},{"$f":"IFERROR(VLOOKUP(IF(A958=\"\",\"\",MONTH(A958)),$P$3:$Q$14,2,FALSE),\"\")","v":"Luty"},{"$f":"IF(A958=\"\",\"\",YEAR(A958))","v":2018},{"$f":"H958","v":"Luty"}]
["2018-02-26","I",560,16,null,16,26,"Luty",2018,"Luty"]
["2018-02-26","I",575,28,null,28,26,"Luty",2018,"Luty"]
["2018-02-26","I",2035613,21,null,21,26,"Luty",2018,"Luty"]
["2018-02-26","I",2297015,21,null,21,26,"Luty",2018,"Luty"]
["2018-02-26","I","717F",496,24,520,26,"Luty",2018,"Luty"]
["2018-02-26","I",416,10,null,10,26,"Luty",2018,"Luty"]
["2018-02-26","I",958,3,null,3,26,"Luty",2018,"Luty"]
["2018-02-26","I","716F",425,4,429,26,"Luty",2018,"Luty"]
["2018-02-26","I",2001723,6,null,6,26,"Luty",2018,"Luty"]
["2018-02-26","I",25,73,null,73,26,"Luty",2018,"Luty"]
["2018-02-26","I",871,10,null,10,26,"Luty",2018,"Luty"]
["2018-02-26","I",469,199,null,199,26,"Luty",2018,"Luty"]
["2018-02-26","I",326,2699,16,2715,26,"Luty",2018,"Luty"]
["2018-02-26","I",514,69,2,71,26,"Luty",2018,"Luty"]
["2018-02-26","I",76,572,2,574,26,"Luty",2018,"Luty"]
["2018-02-26","I",2408708,432,1,433,26,"Luty",2018,"Luty"]
["2018-02-26","III",358,47,13,60,26,"Luty",2018,"Luty"]
["2018-02-26","III",356,317,62,379,26,"Luty",2018,"Luty"]
["2018-02-26","III",2310044,216,null,216,26,"Luty",2018,"Luty"]
["2018-02-26","III",498,2394,1,2395,26,"Luty",2018,"Luty"]
["2018-02-26","III",2451636,180,null,180,26,"Luty",2018,"Luty"]
["2018-02-27","I","300F",148,1,{"$f":"IF(A980=\"\",\"\",D980+E980)","v":149},{"$f":"IF(A980=\"\",\"\",DAY(A980))","v":27},{"$f":"IFERROR(VLOOKUP(IF(A980=\"\",\"\",MONTH(A980)),$P$3:$Q$14,2,FALSE),\"\")","v":"Luty"},{"$f":"IF(A980=\"\",\"\",YEAR(A980))","v":2018},{"$f":"H980","v":"Luty"}]
["2018-02-27","I","802F",33,null,33,27,"Luty",2018,"Luty"]
["2018-02-27","I",514,21,null,21,27,"Luty",2018,"Luty"]
["2018-02-27","I",701,8,null,8,27,"Luty",2018,"Luty"]
["2018-02-27","I",2310044,360,null,360,27,"Luty",2018,"Luty"]
["2018-02-27","I",2435318,20,null,20,27,"Luty",2018,"Luty"]
["2018-02-27","I",888,25,null,25,27,"Luty",2018,"Luty"]
["2018-02-27","I",1533713,18,null,18,27,"Luty",2018,"Luty"]
["2018-02-27","I",418,10,null,10,27,"Luty",2018,"Luty"]
["2018-02-27","I",341,12,null,12,27,"Luty",2018,"Luty"]
["2018-02-27","I",498,2783,null,2783,27,"Luty",2018,"Luty"]
["2018-02-27","I",726,160,null,160,27,"Luty",2018,"Luty"]
["2018-02-27","I","300F",14,null,14,27,"Luty",2018,"Luty"]
["2018-02-27","I","334F",800,16,816,27,"Luty",2018,"Luty"]
["2018-02-27","II",198,200,null,{"$f":"IF(A994=\"\",\"\",D994+E994)","v":200},{"$f":"IF(A994=\"\",\"\",DAY(A994))","v":27},{"$f":"IFERROR(VLOOKUP(IF(A994=\"\",\"\",MONTH(A994)),$P$3:$Q$14,2,FALSE),\"\")","v":"Luty"},{"$f":"IF(A994=\"\",\"\",YEAR(A994))","v":2018},{"$f":"H994","v":"Luty"}]
["2018-02-27","II",160,216,null,216,27,"Luty",2018,"Luty"]
["2018-02-27","II",153,18,null,18,27,"Luty",2018,"Luty"]
["2018-02-27","II",2538162,6,null,6,27,"Luty",2018,"Luty"]
["2018-02-27","II",2432300,360,null,360,27,"Luty",2018,"Luty"]
["2018-02-27","II",431,132,null,132,27,"Luty",2018,"Luty"]
["2018-02-27","I",839,50,null,{"$f":"IF(A1000=\"\",\"\",D1000+E1000)","v":50},{"$f":"IF(A1000=\"\",\"\",DAY(A1000))","v":27},{"$f":"IFERROR(VLOOKUP(IF(A1000=\"\",\"\",MONTH(A1000)),$P$3:$Q$14,2,FALSE),\"\")","v":"Luty"},{"$f":"IF(A1000=\"\",\"\",YEAR(A1000))","v":2018},{"$f":"H1000","v":"Luty"}]
["2018-02-27","I",560,16,null,16,27,"Luty",2018,"Luty"]
["2018-02-27","I",575,28,null,28,27,"Luty",2018,"Luty"]
["2018-02-27","I",2035613,21,null,21,27,"Luty",2018,"Luty"]
["2018-02-27","I",2297015,21,null,21,27,"Luty",2018,"Luty"]
["2018-02-27","I","717F",496,24,520,27,"Luty",2018,"Luty"]
["2018-02-27","I",416,10,null,10,27,"Luty",2018,"Luty"]
["2018-02-27","I",958,3,null,3,27,"Luty",2018,"Luty"]
["2018-02-27","I","716F",425,4,429,27,"Luty",2018,"Luty"]
["2018-02-27","I",2001723,6,null,6,27,"Luty",2018,"Luty"]
["2018-02-27","I",25,73,null,73,27,"Luty",2018,"Luty"]
["2018-02-27","I",871,10,null,10,27,"Luty",2018,"Luty"]
["2018-02-27","I",469,199,null,199,27,"Luty",2018,"Luty"]
["2018-02-27","I",326,2699,16,2715,27,"Luty",2018,"Luty"]
["2018-02-27","I",514,69,2,71,27,"Luty",2018,"Luty"]
["2018-02-27","I",76,572,2,574,27,"Luty",2018,"Luty"]
["2018-02-27","I",2408708,432,1,433,27,"Luty",2018,"Luty"]
["2018-02-27","III",498,400,null,400,27,"Luty",2018,"Luty"]
["2018-02-27","III",326,1991,null,1991,27,"Luty",2018,"Luty"]
["2018-02-27","III",2451635,330,2,332,27,"Luty",2018,"Luty"]
["2018-02-27","III",2451636,360,null,360,27,"Luty",2018,"Luty"]
["2018-02-27","III",701,27,null,27,27,"Luty",2018,"Luty"]
["2018-02-27","III",733,10,null,10,27,"Luty",2018,"Luty"]
["2018-02-28","I",839,50,null,{"$f":"IF(A1023=\"\",\"\",D1023+E1023)","v":50},{"$f":"IF(A1023=\"\",\"\",DAY(A1023))","v":28},{"$f":"IFERROR(VLOOKUP(IF(A1023=\"\",\"\",MONTH(A1023)),$P$3:$Q$14,2,FALSE),\"\")","v":"Luty"},{"$f":"IF(A1023=\"\",\"\",YEAR(A1023))","v":2018},{"$f":"H1023","v":"Luty"}]
["2018-02-28","I",560,16,null,16,28,"Luty",2018,"Luty"]
["2018-02-28","I",575,28,null,28,28,"Luty",2018,"Luty"]
["2018-02-28","I",2035613,21,null,21,28,"Luty",2018,"Luty"]
["2018-02-28","I",2297015,21,null,21,28,"Luty",2018,"Luty"]
["2018-02-28","I","717F",496,24,520,28,"Luty",2018,"Luty"]
["2018-02-28","I",416,10,null,10,28,"Luty",2018,"Luty"]
["2018-02-28","I",958,3,null,3,28,"Luty",2018,"Luty"]
["2018-02-28","I","716F",425,4,429,28,"Luty",2018,"Luty"]
["2018-02-28","I",2001723,6,null,6,28,"Luty",2018,"Luty"]
["2018-02-28","I",25,73,null,73,28,"Luty",2018,"Luty"]
["2018-02-28","I",871,10,null,10,28,"Luty",2018,"Luty"]
["2018-02-28","I",469,199,null,199,28,"Luty",2018,"Luty"]
["2018-02-28","I",326,2699,16,2715,28,"Luty",2018,"Luty"]
["2018-02-28","I",514,69,2,71,28,"Luty",2018,"Luty"]
["2018-02-28","I",76,572,2,574,28,"Luty",2018,"Luty"]
["2018-02-28","I",2408708,432,1,433,28,"Luty",2018,"Luty"]
["2018-02-28","II",844,40,null,40,28,"Luty",2018,"Luty"]
["2018-02-28","II",845,20,null,20,28,"Luty",2018,"Luty"]
["2018-02-28","II",513,112,2,114,28,"Luty",2018,"Luty"]
["2018-02-28","II",2408709,220,4,224,28,"Luty",2018,"Luty"]
["2018-02-28","II",119,325,3,328,28,"Luty",2018,"Luty"]
["2018-02-28","I",839,50,null,{"$f":"IF(A1045=\"\",\"\",D1045+E1045)","v":50},{"$f":"IF(A1045=\"\",\"\",DAY(A1045))","v":28},{"$f":"IFERROR(VLOOKUP(IF(A1045=\"\",\"\",MONTH(A1045)),$P$3:$Q$14,2,FALSE),\"\")","v":"Luty"},{"$f":"IF(A1045=\"\",\"\",YEAR(A1045))","v":2018},{"$f":"H1045","v":"Luty"}]
["2018-02-28","I",560,16,null,16,28,"Luty",2018,"Luty"]
["2018-02-28","I",575,28,null,28,28,"Luty",2018,"Luty"]
["2018-02-28","I",2035613,21,null,21,28,"Luty",2018,"Luty"]
["2018-02-28","I",2297015,21,null,21,28,"Luty",2018,"Luty"]
["2018-02-28","I","717F",496,24,520,28,"Luty",2018,"Luty"]
["2018-02-28","I",416,10,null,10,28,"Luty",2018,"Luty"]
["2018-02-28","I",958,3,null,3,28,"Luty",2018,"Luty"]
["2018-02-28","I","716F",425,4,429,28,"Luty",2018,"Luty"]
["2018-02-28","I",2001723,6,null,6,28,"Luty",2018,"Luty"]
["2018-02-28","I",25,73,null,73,28,"Luty",2018,"Luty"]
["2018-02-28","I",871,10,null,10,28,"Luty",2018,"Luty"]
["2018-02-28","I",469,199,null,199,28,"Luty",2018,"Luty"]
["2018-02-28","I",326,2699,16,2715,28,"Luty",2018,"Luty"]
["2018-02-28","I",514,69,2,71,28,"Luty",2018,"Luty"]
["2018-02-28","I",76,572,2,574,28,"Luty",2018,"Luty"]
["2018-02-28","I",2408708,432,1,433,28,"Luty",2018,"Luty"]
["2018-02-28","III",358,115,17,132,28,"Luty",2018,"Luty"]
["2018-02-28","III",498,1593,null,1593,28,"Luty",2018,"Luty"]
["2018-02-28","III",26144994,755,6,761,28,"Luty",2018,"Luty"]
["2018-02-28","III",2296305,400,null,400,28,"Luty",2018,"Luty"]
["2018-02-28","III",437,372,null,372,28,"Luty",2018,"Luty"]
["2018-03-01","I","33501F",250,1,{"$f":"IF(A1067=\"\",\"\",D1067+E1067)","v":251},{"$f":"IF(A1067=\"\",\"\",DAY(A1067))","v":1},{"$f":"IFERROR(VLOOKUP(IF(A1067=\"\",\"\",MONTH(A1067)),$P$3:$Q$14,2,FALSE),\"\")","v":"Marzec"},{"$f":"IF(A1067=\"\",\"\",YEAR(A1067))","v":2018},{"$f":"H1067","v":"Marzec"}]
["2018-03-01","I","33503F",500,null,500,1,"Marzec",2018,"Marzec"]
["2018-03-01","I",761,60,null,60,1,"Marzec",2018,"Marzec"]
["2018-03-01","I",415,10,null,10,1,"Marzec",2018,"Marzec"]
["2018-03-01","I",694,6,null,6,1,"Marzec",2018,"Marzec"]
["2018-03-01","I",593,15,null,15,1,"Marzec",2018,"Marzec"]
["2018-03-01","I",871,10,null,10,1,"Marzec",2018,"Marzec"]
["2018-03-01","I",570,320,null,320,1,"Marzec",2018,"Marzec"]
["2018-03-01","I","716F",34,null,34,1,"Marzec",2018,"Marzec"]
["2018-03-01","I","334F",620,null,620,1,"Marzec",2018,"Marzec"]
["2018-03-01","I",498,2602,null,2602,1,"Marzec",2018,"Marzec"]
["2018-03-01","I",2149709,120,null,120,1,"Marzec",2018,"Marzec"]
["2018-03-01","II",844,40,null,{"$f":"IF(A1079=\"\",\"\",D1079+E1079)","v":40},{"$f":"IF(A1079=\"\",\"\",DAY(A1079))","v":1},{"$f":"IFERROR(VLOOKUP(IF(A1079=\"\",\"\",MONTH(A1079)),$P$3:$Q$14,2,FALSE),\"\")","v":"Marzec"},{"$f":"IF(A1079=\"\",\"\",YEAR(A1079))","v":2018},{"$f":"H1079","v":"Marzec"}]
["2018-03-01","II",616,4,null,4,1,"Marzec",2018,"Marzec"]
["2018-03-01","II",617,4,null,4,1,"Marzec",2018,"Marzec"]
["2018-03-01","II",198,200,null,200,1,"Marzec",2018,"Marzec"]
["2018-03-01","II",894,242,null,242,1,"Marzec",2018,"Marzec"]
["2018-03-01","II","300F",18,null,18,1,"Marzec",2018,"Marzec"]
["2018-03-01","II",812,350,51,401,1,"Marzec",2018,"Marzec"]
["2018-03-01","I",839,50,null,{"$f":"IF(A1086=\"\",\"\",D1086+E1086)","v":50},{"$f":"IF(A1086=\"\",\"\",DAY(A1086))","v":1},{"$f":"IFERROR(VLOOKUP(IF(A1086=\"\",\"\",MONTH(A1086)),$P$3:$Q$14,2,FALSE),\"\")","v":"Marzec"},{"$f":"IF(A1086=\"\",\"\",YEAR(A1086))","v":2018},{"$f":"H1086","v":"Marzec"}]
["2018-03-01","I",560,16,null,16,1,"Marzec",2018,"Marzec"]
["2018-03-01","I",575,28,null,28,1,"Marzec",2018,"Marzec"]
["2018-03-01","I",2035613,21,null,21,1,"Marzec",2018,"Marzec"]
["2018-03-01","I",2297015,21,null,21,1,"Marzec",2018,"Marzec"]
["2018-03-01","I","717F",496,24,520,1,"Marzec",2018,"Marzec"]
["2018-03-01","I",416,10,null,10,1,"Marzec",2018,"Marzec"]
["2018-03-01","I",958,3,null,3,1,"Marzec",2018,"Marzec"]
["2018-03-01","I","716F",425,4,429,1,"Marzec",2018,"Marzec"]
["2018-03-01","I",2001723,6,null,6,1,"Marzec",2018,"Marzec"]
["2018-03-01","I",25,73,null,73,1,"Marzec",2018,"Marzec"]
["2018-03-01","I",871,10,null,10,1,"Marzec",2018,"Marzec"]
["2018-03-01","I",469,199,null,199,1,"Marzec",2018,"Marzec"]
["2018-03-01","I",326,2699,16,2715,1,"Marzec",2018,"Marzec"]
["2018-03-01","I",514,69,2,71,1,"Marzec",2018,"Marzec"]
["2018-03-01","I",76,572,2,574,1,"Marzec",2018,"Marzec"]
["2018-03-01","I",2408708,432,1,433,1,"Marzec",2018,"Marzec"]
["2018-03-01","III",269,97,null,97,1,"Marzec",2018,"Marzec"]
["2018-03-01","III",560,340,null,340,1,"Marzec",2018,"Marzec"]
["2018-03-01","III",498,2398,2,2400,1,"Marzec",2018,"Marzec"]
["2018-03-01","III",812,900,15,915,1,"Marzec",2018,"Marzec"]
["2018-03-02","I",2030723,200,null,{"$f":"IF(A1107=\"\",\"\",D1107+E1107)","v":200},{"$f":"IF(A1107=\"\",\"\",DAY(A1107))","v":2},{"$f":"IFERROR(VLOOKUP(IF(A1107=\"\",\"\",MONTH(A1107)),$P$3:$Q$14,2,FALSE),\"\")","v":"Marzec"},{"$f":"IF(A1107=\"\",\"\",YEAR(A1107))","v":2018},{"$f":"H1107","v":"Marzec"}]
["2018-03-02","I",37,34,null,34,2,"Marzec",2018,"Marzec"]
["2018-03-02","I",2149709,180,null,180,2,"Marzec",2018,"Marzec"]
["2018-03-02","I",593,40,null,40,2,"Marzec",2018,"Marzec"]
["2018-03-02","I",634,223,6,229,2,"Marzec",2018,"Marzec"]
["2018-03-02","I",498,2377,4,2381,2,"Marzec",2018,"Marzec"]
["2018-03-02","I",76,198,null,198,2,"Marzec",2018,"Marzec"]
["2018-03-02","I",119,440,null,440,2,"Marzec",2018,"Marzec"]
["2018-03-02","I",2001723,6,null,6,2,"Marzec",2018,"Marzec"]
["2018-03-02","I",701,27,null,27,2,"Marzec",2018,"Marzec"]
["2018-03-02","I",702,27,null,27,2,"Marzec",2018,"Marzec"]
["2018-03-02","I",289,9,null,9,2,"Marzec",2018,"Marzec"]
["2018-03-02","II",2149709,120,null,{"$f":"IF(A1119=\"\",\"\",D1119+E1119)","v":120},{"$f":"IF(A1119=\"\",\"\",DAY(A1119))","v":2},{"$f":"IFERROR(VLOOKUP(IF(A1119=\"\",\"\",MONTH(A1119)),$P$3:$Q$14,2,FALSE),\"\")","v":"Marzec"},{"$f":"IF(A1119=\"\",\"\",YEAR(A1119))","v":2018},{"$f":"H1119","v":"Marzec"}]
["2018-03-02","II",2219049,10,null,10,2,"Marzec",2018,"Marzec"]
["2018-03-02","II",514,15,null,15,2,"Marzec",2018,"Marzec"]
["2018-03-02","II",2418976,240,null,240,2,"Marzec",2018,"Marzec"]
["2018-03-02","II",2418977,240,3,243,2,"Marzec",2018,"Marzec"]
["2018-03-02","II",933,500,null,500,2,"Marzec",2018,"Marzec"]
["2018-03-02","II",498,2414,1,2415,2,"Marzec",2018,"Marzec"]
["2018-03-02","II",791,240,null,240,2,"Marzec",2018,"Marzec"]
["2018-03-03","I","s122309",225,null,{"$f":"IF(A1127=\"\",\"\",D1127+E1127)","v":225},{"$f":"IF(A1127=\"\",\"\",DAY(A1127))","v":3},{"$f":"IFERROR(VLOOKUP(IF(A1127=\"\",\"\",MONTH(A1127)),$P$3:$Q$14,2,FALSE),\"\")","v":"Marzec"},{"$f":"IF(A1127=\"\",\"\",YEAR(A1127))","v":2018},{"$f":"H1127","v":"Marzec"}]
["2018-03-03","I",119,1040,43,1083,3,"Marzec",2018,"Marzec"]
["2018-03-03","I",76,1000,null,1000,3,"Marzec",2018,"Marzec"]
["2018-03-05","I","718F",4,null,4,5,"Marzec",2018,"Marzec"]
["2018-03-05","I","33501F",367,1,368,5,"Marzec",2018,"Marzec"]
["2018-03-05","I",2296305,150,2,152,5,"Marzec",2018,"Marzec"]
["2018-03-05","I",414,24,null,24,5,"Marzec",2018,"Marzec"]
["2018-03-05","I",418,10,null,10,5,"Marzec",2018,"Marzec"]
["2018-03-05","I",415,10,null,10,5,"Marzec",2018,"Marzec"]
["2018-03-05","I",498,1795,1,1796,5,"Marzec",2018,"Marzec"]
["2018-03-05","I",26144994,1321,null,1321,5,"Marzec",2018,"Marzec"]
["2018-03-05","I",48,10,null,10,5,"Marzec",2018,"Marzec"]
["2018-03-05","I",122,104,null,104,5,"Marzec",2018,"Marzec"]
["2018-03-05","I",319,2,null,2,5,"Marzec",2018,"Marzec"]
["2018-03-05","I",391,12,null,12,5,"Marzec",2018,"Marzec"]
["2018-03-05","I",2067417,10,null,10,5,"Marzec",2018,"Marzec"]
["2018-03-05","I",416,10,null,10,5,"Marzec",2018,"Marzec"]
["2018-03-05","I",554,10,null,10,5,"Marzec",2018,"Marzec"]
["2018-03-05","I",958,12,null,12,5,"Marzec",2018,"Marzec"]
["2018-03-05","I","717F",716,66,782,5,"Marzec",2018,"Marzec"]
["2018-03-05","I",2297015,286,32,318,5,"Marzec",2018,"Marzec"]
["2018-03-05","I",2432300,500,8,508,5,"Marzec",2018,"Marzec"]
["2018-03-05","I",701,4,null,4,5,"Marzec",2018,"Marzec"]
["2018-03-03","II",1745895,7,null,{"$f":"IF(A1150=\"\",\"\",D1150+E1150)","v":7},{"$f":"IF(A1150=\"\",\"\",DAY(A1150))","v":3},{"$f":"IFERROR(VLOOKUP(IF(A1150=\"\",\"\",MONTH(A1150)),$P$3:$Q$14,2,FALSE),\"\")","v":"Marzec"},{"$f":"IF(A1150=\"\",\"\",YEAR(A1150))","v":2018},{"$f":"H1150","v":"Marzec"}]
["2018-03-03","II",896,1,null,1,3,"Marzec",2018,"Marzec"]
["2018-03-03","II",198,300,null,300,3,"Marzec",2018,"Marzec"]
["2018-03-03","II",2632895,1,null,1,3,"Marzec",2018,"Marzec"]
["2018-03-03","II",570,220,null,220,3,"Marzec",2018,"Marzec"]
["2018-03-03","II",179,1290,39,1329,3,"Marzec",2018,"Marzec"]
["2018-03-03","II",2408708,622,5,627,3,"Marzec",2018,"Marzec"]
["2018-03-05","III",326,2392,2,{"$f":"IF(A1157=\"\",\"\",D1157+E1157)","v":2394},{"$f":"IF(A1157=\"\",\"\",DAY(A1157))","v":5},{"$f":"IFERROR(VLOOKUP(IF(A1157=\"\",\"\",MONTH(A1157)),$P$3:$Q$14,2,FALSE),\"\")","v":"Marzec"},{"$f":"IF(A1157=\"\",\"\",YEAR(A1157))","v":2018},{"$f":"H1157","v":"Marzec"}]
["2018-03-05","III",212,40,null,40,5,"Marzec",2018,"Marzec"]
["2018-03-05","III",214,5,null,5,5,"Marzec",2018,"Marzec"]
["2018-03-05","III",310,50,null,50,5,"Marzec",2018,"Marzec"]
["2018-03-05","III",192,10,null,10,5,"Marzec",2018,"Marzec"]
["2018-03-06","II",958,12,null,12,6,"Marzec",2018,"Marzec"]
["2018-03-06","II",544,6,null,6,6,"Marzec",2018,"Marzec"]
["2018-03-06","II","334F",880,59,939,6,"Marzec",2018,"Marzec"]
["2018-03-06","II",966,36,null,36,6,"Marzec",2018,"Marzec"]
["2018-03-06","II",414,10,null,10,6,"Marzec",2018,"Marzec"]
["2018-03-06","II",2297015,39,null,39,6,"Marzec",2018,"Marzec"]
["2018-03-06","II",1901726,140,null,140,6,"Marzec",2018,"Marzec"]
["2018-03-06","II",437,184,null,184,6,"Marzec",2018,"Marzec"]
["2018-03-06","II",780,20,null,20,6,"Marzec",2018,"Marzec"]
["2018-03-06","II",97,30,null,30,6,"Marzec",2018,"Marzec"]
["2018-03-06","II",326,2484,1,2485,6,"Marzec",2018,"Marzec"]
["2018-03-06","II",2451635,195,null,195,6,"Marzec",2018,"Marzec"]
["2018-03-06","II",812,450,18,468,6,"Marzec",2018,"Marzec"]
["2018-03-06","II",2126381,80,null,80,6,"Marzec",2018,"Marzec"]
["2018-03-06","II",198,100,null,{"$f":"IF(A1176=\"\",\"\",D1176+E1176)","v":100},{"$f":"IF(A1176=\"\",\"\",DAY(A1176))","v":6},{"$f":"IFERROR(VLOOKUP(IF(A1176=\"\",\"\",MONTH(A1176)),$P$3:$Q$14,2,FALSE),\"\")","v":"Marzec"},{"$f":"IF(A1176=\"\",\"\",YEAR(A1176))","v":2018},{"$f":"H1176","v":"Marzec"}]
["2018-03-06","II",2451636,390,null,390,6,"Marzec",2018,"Marzec"]
["2018-03-06","II",414,10,null,10,6,"Marzec",2018,"Marzec"]
["2018-03-06","II",575,320,null,320,6,"Marzec",2018,"Marzec"]
["2018-03-06","II",2451635,345,null,345,6,"Marzec",2018,"Marzec"]
["2018-03-07","I","708F",296,6,302,7,"Marzec",2018,"Marzec"]
["2018-03-07","I",26144994,570,null,570,7,"Marzec",2018,"Marzec"]
["2018-03-07","I",498,2192,null,2192,7,"Marzec",2018,"Marzec"]
["2018-03-07","I","800-569488-F",60,null,60,7,"Marzec",2018,"Marzec"]
["2018-03-07","I","800-569638-F",64,null,64,7,"Marzec",2018,"Marzec"]
["2018-03-07","I","500F",12,null,12,7,"Marzec",2018,"Marzec"]
["2018-03-07","I",179,38,null,38,7,"Marzec",2018,"Marzec"]
["2018-03-07","I","33505F",120,null,120,7,"Marzec",2018,"Marzec"]
["2018-03-07","I",2113026,20,null,20,7,"Marzec",2018,"Marzec"]
["2018-03-07","I",289,9,null,9,7,"Marzec",2018,"Marzec"]
["2018-03-07","I",2451635,210,null,210,7,"Marzec",2018,"Marzec"]
["2018-03-07","I","33503F",250,null,250,7,"Marzec",2018,"Marzec"]
["2018-03-07","I",888,21,null,21,7,"Marzec",2018,"Marzec"]
["2018-03-07","I",812,550,29,579,7,"Marzec",2018,"Marzec"]
["2018-03-07","I",202,120,null,120,7,"Marzec",2018,"Marzec"]
["2018-03-07","I",780,20,null,20,7,"Marzec",2018,"Marzec"]
["2018-03-07","I",162,6,null,6,7,"Marzec",2018,"Marzec"]
["2018-03-07","II",693,34,null,{"$f":"IF(A1198=\"\",\"\",D1198+E1198)","v":34},{"$f":"IF(A1198=\"\",\"\",DAY(A1198))","v":7},{"$f":"IFERROR(VLOOKUP(IF(A1198=\"\",\"\",MONTH(A1198)),$P$3:$Q$14,2,FALSE),\"\")","v":"Marzec"},{"$f":"IF(A1198=\"\",\"\",YEAR(A1198))","v":2018},{"$f":"H1198","v":"Marzec"}]
["2018-03-07","II",2149709,111,null,111,7,"Marzec",2018,"Marzec"]
["2018-03-07","II",198,100,null,100,7,"Marzec",2018,"Marzec"]
["2018-03-07","II",746,20,null,20,7,"Marzec",2018,"Marzec"]
["2018-03-07","II",844,56,null,56,7,"Marzec",2018,"Marzec"]
["2018-03-07","II",2296305,450,null,450,7,"Marzec",2018,"Marzec"]
["2018-03-07","II",543,150,null,150,7,"Marzec",2018,"Marzec"]
["2018-03-07","II",2297015,286,19,305,7,"Marzec",2018,"Marzec"]
["2018-03-07","III",26144994,380,null,{"$f":"IF(A1206=\"\",\"\",D1206+E1206)","v":380},{"$f":"IF(A1206=\"\",\"\",DAY(A1206))","v":7},{"$f":"IFERROR(VLOOKUP(IF(A1206=\"\",\"\",MONTH(A1206)),$P$3:$Q$14,2,FALSE),\"\")","v":"Marzec"},{"$f":"IF(A1206=\"\",\"\",YEAR(A1206))","v":2018},{"$f":"H1206","v":"Marzec"}]
["2018-03-07","III",326,1960,9,1969,7,"Marzec",2018,"Marzec"]
["2018-03-08","I","721F",245,33,278,8,"Marzec",2018,"Marzec"]
["2018-03-08","I",2149709,95,7,102,8,"Marzec",2018,"Marzec"]
["2018-03-08","I",780,80,null,80,8,"Marzec",2018,"Marzec"]
["2018-03-08","I",2113026,4,null,4,8,"Marzec",2018,"Marzec"]
["2018-03-08","I",761,20,6,26,8,"Marzec",2018,"Marzec"]
["2018-03-08","I","717F",581,49,630,8,"Marzec",2018,"Marzec"]
["2018-03-08","I",2001723,6,null,6,8,"Marzec",2018,"Marzec"]
["2018-03-08","I",326,2198,2,2200,8,"Marzec",2018,"Marzec"]
["2018-03-08","I",26144994,189,null,189,8,"Marzec",2018,"Marzec"]
["2018-03-08","I",812,420,null,420,8,"Marzec",2018,"Marzec"]
["2018-03-08","I",2237976,146,null,146,8,"Marzec",2018,"Marzec"]
["2018-03-08","I",341,12,null,12,8,"Marzec",2018,"Marzec"]
["2018-03-08","II",843,10,null,{"$f":"IF(A1220=\"\",\"\",D1220+E1220)","v":10},{"$f":"IF(A1220=\"\",\"\",DAY(A1220))","v":8},{"$f":"IFERROR(VLOOKUP(IF(A1220=\"\",\"\",MONTH(A1220)),$P$3:$Q$14,2,FALSE),\"\")","v":"Marzec"},{"$f":"IF(A1220=\"\",\"\",YEAR(A1220))","v":2018},{"$f":"H1220","v":"Marzec"}]
["2018-03-08","II",307,40,null,40,8,"Marzec",2018,"Marzec"]
["2018-03-08","II",162,162,null,162,8,"Marzec",2018,"Marzec"]
["2018-03-08","II",2007977,180,155,335,8,"Marzec",2018,"Marzec"]
["2018-03-08","II",701,4,null,4,8,"Marzec",2018,"Marzec"]
["2018-03-08","II",787,339,11,350,8,"Marzec",2018,"Marzec"]
["2018-03-08","II",252,332,null,332,8,"Marzec",2018,"Marzec"]
["2018-03-08","II",76,484,null,484,8,"Marzec",2018,"Marzec"]
["2018-03-08","II",570,510,null,510,8,"Marzec",2018,"Marzec"]
["2018-03-08","II",431,144,null,144,8,"Marzec",2018,"Marzec"]
["2018-03-08","III",326,2407,null,{"$f":"IF(A1230=\"\",\"\",D1230+E1230)","v":2407},{"$f":"IF(A1230=\"\",\"\",DAY(A1230))","v":8},{"$f":"IFERROR(VLOOKUP(IF(A1230=\"\",\"\",MONTH(A1230)),$P$3:$Q$14,2,FALSE),\"\")","v":"Marzec"},{"$f":"IF(A1230=\"\",\"\",YEAR(A1230))","v":2018},{"$f":"H1230","v":"Marzec"}]
["2018-03-09","I",326,633,null,633,9,"Marzec",2018,"Marzec"]
["2018-03-09","I",498,1791,2,1793,9,"Marzec",2018,"Marzec"]
["2018-03-09","I",996,458,null,458,9,"Marzec",2018,"Marzec"]
["2018-03-09","I",162,12,null,12,9,"Marzec",2018,"Marzec"]
["2018-03-09","I",416,10,null,10,9,"Marzec",2018,"Marzec"]
["2018-03-09","I",415,10,null,10,9,"Marzec",2018,"Marzec"]
["2018-03-09","I",554,10,null,10,9,"Marzec",2018,"Marzec"]
["2018-03-09","I",560,12,null,12,9,"Marzec",2018,"Marzec"]
["2018-03-09","I",289,9,null,9,9,"Marzec",2018,"Marzec"]
["2018-03-09","I",701,27,null,27,9,"Marzec",2018,"Marzec"]
["2018-03-09","I",69,20,null,20,9,"Marzec",2018,"Marzec"]
["2018-03-09","I",547,41,null,41,9,"Marzec",2018,"Marzec"]
["2018-03-09","I",37,20,null,20,9,"Marzec",2018,"Marzec"]
["2018-03-09","I","708F",603,null,603,9,"Marzec",2018,"Marzec"]
["2018-03-09","I",2310044,456,null,456,9,"Marzec",2018,"Marzec"]
["2018-03-09","I",2432300,580,null,580,9,"Marzec",2018,"Marzec"]
["2018-03-09","II",198,100,1,{"$f":"IF(A1247=\"\",\"\",D1247+E1247)","v":101},{"$f":"IF(A1247=\"\",\"\",DAY(A1247))","v":9},{"$f":"IFERROR(VLOOKUP(IF(A1247=\"\",\"\",MONTH(A1247)),$P$3:$Q$14,2,FALSE),\"\")","v":"Marzec"},{"$f":"IF(A1247=\"\",\"\",YEAR(A1247))","v":2018},{"$f":"H1247","v":"Marzec"}]
["2018-03-09","II",933,350,null,350,9,"Marzec",2018,"Marzec"]
["2018-03-09","II","300F",190,null,190,9,"Marzec",2018,"Marzec"]
["2018-03-09","II",894,200,12,212,9,"Marzec",2018,"Marzec"]
["2018-03-09","II",571,384,null,384,9,"Marzec",2018,"Marzec"]
["2018-03-09","II",767,20,null,20,9,"Marzec",2018,"Marzec"]
["2018-03-09","II",797,8,null,8,9,"Marzec",2018,"Marzec"]
["2018-03-09","II",97,108,null,108,9,"Marzec",2018,"Marzec"]
["2018-03-09","III",498,2204,null,{"$f":"IF(A1255=\"\",\"\",D1255+E1255)","v":2204},{"$f":"IF(A1255=\"\",\"\",DAY(A1255))","v":9},{"$f":"IFERROR(VLOOKUP(IF(A1255=\"\",\"\",MONTH(A1255)),$P$3:$Q$14,2,FALSE),\"\")","v":"Marzec"},{"$f":"IF(A1255=\"\",\"\",YEAR(A1255))","v":2018},{"$f":"H1255","v":"Marzec"}]
["2018-03-09","III",326,198,null,198,9,"Marzec",2018,"Marzec"]
["2018-03-09","III",1745895,14,null,14,9,"Marzec",2018,"Marzec"]
["2018-03-10","I",1745895,63,null,63,10,"Marzec",2018,"Marzec"]
["2018-03-10","I","334F",1283,67,1350,10,"Marzec",2018,"Marzec"]
["2018-03-10","I",212,60,null,60,10,"Marzec",2018,"Marzec"]
["2018-03-10","I",214,10,null,10,10,"Marzec",2018,"Marzec"]
["2018-03-10","I",119,1040,11,1051,10,"Marzec",2018,"Marzec"]
["2018-03-10","I","33503F",250,null,250,10,"Marzec",2018,"Marzec"]
["2018-03-12","I",787,35,null,{"$f":"IF(A1264=\"\",\"\",D1264+E1264)","v":35},{"$f":"IF(A1264=\"\",\"\",DAY(A1264))","v":12},{"$f":"IFERROR(VLOOKUP(IF(A1264=\"\",\"\",MONTH(A1264)),$P$3:$Q$14,2,FALSE),\"\")","v":"Marzec"},{"$f":"IF(A1264=\"\",\"\",YEAR(A1264))","v":2018},{"$f":"H1264","v":"Marzec"}]
["2018-03-12","I",888,48,null,48,12,"Marzec",2018,"Marzec"]
["2018-03-12","I","33503F",1192,5,1197,12,"Marzec",2018,"Marzec"]
["2018-03-12","I",677,24,null,24,12,"Marzec",2018,"Marzec"]
["2018-03-12","I",498,4,null,4,12,"Marzec",2018,"Marzec"]
["2018-03-12","I",2067417,10,null,10,12,"Marzec",2018,"Marzec"]
["2018-03-12","I",418,20,null,20,12,"Marzec",2018,"Marzec"]
["2018-03-12","I",871,20,null,20,12,"Marzec",2018,"Marzec"]
["2018-03-12","I",704,38,null,38,12,"Marzec",2018,"Marzec"]
["2018-03-12","I",47,1,null,1,12,"Marzec",2018,"Marzec"]
["2018-03-12","I",92,3,null,3,12,"Marzec",2018,"Marzec"]
["2018-03-12","I",562,20,null,20,12,"Marzec",2018,"Marzec"]
["2018-03-12","I",702,27,null,27,12,"Marzec",2018,"Marzec"]
["2018-03-12","I",326,2859,3,2862,12,"Marzec",2018,"Marzec"]
["2018-03-12","I",812,680,52,732,12,"Marzec",2018,"Marzec"]
["2018-03-12","II",2219049,10,null,{"$f":"IF(A1279=\"\",\"\",D1279+E1279)","v":10},{"$f":"IF(A1279=\"\",\"\",DAY(A1279))","v":12},{"$f":"IFERROR(VLOOKUP(IF(A1279=\"\",\"\",MONTH(A1279)),$P$3:$Q$14,2,FALSE),\"\")","v":"Marzec"},{"$f":"IF(A1279=\"\",\"\",YEAR(A1279))","v":2018},{"$f":"H1279","v":"Marzec"}]
["2018-03-12","II",269,71,null,71,12,"Marzec",2018,"Marzec"]
["2018-03-12","II",198,300,null,300,12,"Marzec",2018,"Marzec"]
["2018-03-12","II",437,694,null,694,12,"Marzec",2018,"Marzec"]
["2018-03-12","II",966,14,null,14,12,"Marzec",2018,"Marzec"]
["2018-03-12","II",498,2412,null,2412,12,"Marzec",2018,"Marzec"]
["2018-03-12","II",560,280,null,280,12,"Marzec",2018,"Marzec"]
["2018-03-12","II",634,212,null,212,12,"Marzec",2018,"Marzec"]
["2018-03-12","II",69,140,null,140,12,"Marzec",2018,"Marzec"]
["2018-03-12","III",498,2393,1,{"$f":"IF(A1288=\"\",\"\",D1288+E1288)","v":2394},{"$f":"IF(A1288=\"\",\"\",DAY(A1288))","v":12},{"$f":"IFERROR(VLOOKUP(IF(A1288=\"\",\"\",MONTH(A1288)),$P$3:$Q$14,2,FALSE),\"\")","v":"Marzec"},{"$f":"IF(A1288=\"\",\"\",YEAR(A1288))","v":2018},{"$f":"H1288","v":"Marzec"}]
["2018-03-12","III",839,215,4,219,12,"Marzec",2018,"Marzec"]
["2018-03-12","III",103,49,null,49,12,"Marzec",2018,"Marzec"]
["2018-03-13","I","33503F",91,null,91,13,"Marzec",2018,"Marzec"]
["2018-03-13","I",812,500,null,500,13,"Marzec",2018,"Marzec"]
["2018-03-13","I",2432300,66,null,66,13,"Marzec",2018,"Marzec"]
["2018-03-13","I",570,36,null,36,13,"Marzec",2018,"Marzec"]
["2018-03-13","I",571,30,null,30,13,"Marzec",2018,"Marzec"]
["2018-03-13","I",97,33,null,33,13,"Marzec",2018,"Marzec"]
["2018-03-13","I",761,30,null,30,13,"Marzec",2018,"Marzec"]
["2018-03-13","I",498,2333,null,2333,13,"Marzec",2018,"Marzec"]
["2018-03-13","I",119,12,null,12,13,"Marzec",2018,"Marzec"]
["2018-03-13","I",502,131,null,131,13,"Marzec",2018,"Marzec"]
["2018-03-13","I",310,17,null,17,13,"Marzec",2018,"Marzec"]
["2018-03-13","I",2113026,30,null,30,13,"Marzec",2018,"Marzec"]
["2018-03-13","I","33501F",1084,5,1089,13,"Marzec",2018,"Marzec"]
["2018-03-13","I",529,10,null,10,13,"Marzec",2018,"Marzec"]
["2018-03-13","II",746,40,null,{"$f":"IF(A1305=\"\",\"\",D1305+E1305)","v":40},{"$f":"IF(A1305=\"\",\"\",DAY(A1305))","v":13},{"$f":"IFERROR(VLOOKUP(IF(A1305=\"\",\"\",MONTH(A1305)),$P$3:$Q$14,2,FALSE),\"\")","v":"Marzec"},{"$f":"IF(A1305=\"\",\"\",YEAR(A1305))","v":2018},{"$f":"H1305","v":"Marzec"}]
["2018-03-13","II",616,7,null,7,13,"Marzec",2018,"Marzec"]
["2018-03-13","II",617,7,null,7,13,"Marzec",2018,"Marzec"]
["2018-03-13","II",944,10,null,10,13,"Marzec",2018,"Marzec"]
["2018-03-13","II",896,25,null,25,13,"Marzec",2018,"Marzec"]
["2018-03-13","II",26144994,940,1,941,13,"Marzec",2018,"Marzec"]
["2018-03-13","II",2334641,276,null,276,13,"Marzec",2018,"Marzec"]
["2018-03-13","II",693,2437,null,2437,13,"Marzec",2018,"Marzec"]
["2018-03-13","II",76,572,null,572,13,"Marzec",2018,"Marzec"]
["2018-03-13","II",2297015,416,125,541,13,"Marzec",2018,"Marzec"]
["2018-03-13","III",26144994,569,null,{"$f":"IF(A1315=\"\",\"\",D1315+E1315)","v":569},{"$f":"IF(A1315=\"\",\"\",DAY(A1315))","v":13},{"$f":"IFERROR(VLOOKUP(IF(A1315=\"\",\"\",MONTH(A1315)),$P$3:$Q$14,2,FALSE),\"\")","v":"Marzec"},{"$f":"IF(A1315=\"\",\"\",YEAR(A1315))","v":2018},{"$f":"H1315","v":"Marzec"}]
["2018-03-13","III",498,1605,null,1605,13,"Marzec",2018,"Marzec"]
["2018-03-13","III",326,199,null,199,13,"Marzec",2018,"Marzec"]
["2018-03-13","III","33505F",240,3,243,13,"Marzec",2018,"Marzec"]
["2018-03-13","III",2310044,360,null,360,13,"Marzec",2018,"Marzec"]
["2018-03-14","II",179,301,50,351,14,"Marzec",2018,"Marzec"]
["2018-03-14","II",269,88,null,88,14,"Marzec",2018,"Marzec"]
["2018-03-14","II",358,5,null,5,14,"Marzec",2018,"Marzec"]
["2018-03-14","II",560,68,16,84,14,"Marzec",2018,"Marzec"]
["2018-03-14","II",41,60,null,60,14,"Marzec",2018,"Marzec"]
["2018-03-14","II",101,322,1,323,14,"Marzec",2018,"Marzec"]
["2018-03-14","II",2334641,120,null,120,14,"Marzec",2018,"Marzec"]
["2018-03-14","II",2334641,140,null,140,14,"Marzec",2018,"Marzec"]
["2018-03-14","II",2432300,120,null,120,14,"Marzec",2018,"Marzec"]
["2018-03-14","II",966,40,21,61,14,"Marzec",2018,"Marzec"]
["2018-03-14","III",845,20,1,{"$f":"IF(A1330=\"\",\"\",D1330+E1330)","v":21},{"$f":"IF(A1330=\"\",\"\",DAY(A1330))","v":14},{"$f":"IFERROR(VLOOKUP(IF(A1330=\"\",\"\",MONTH(A1330)),$P$3:$Q$14,2,FALSE),\"\")","v":"Marzec"},{"$f":"IF(A1330=\"\",\"\",YEAR(A1330))","v":2018},{"$f":"H1330","v":"Marzec"}]
["2018-03-14","III",844,24,null,24,14,"Marzec",2018,"Marzec"]
["2018-03-14","III",378,28,null,28,14,"Marzec",2018,"Marzec"]
["2018-03-14","III",724,10,null,10,14,"Marzec",2018,"Marzec"]
["2018-03-14","III",310,30,null,30,14,"Marzec",2018,"Marzec"]
["2018-03-14","III",26144994,378,null,378,14,"Marzec",2018,"Marzec"]
["2018-03-14","III",498,977,7,984,14,"Marzec",2018,"Marzec"]
["2018-03-14","III",326,1000,3,1003,14,"Marzec",2018,"Marzec"]
["2018-03-14","III",2451636,330,1,331,14,"Marzec",2018,"Marzec"]
["2018-03-15","I",179,55,null,{"$f":"IF(A1339=\"\",\"\",D1339+E1339)","v":55},{"$f":"IF(A1339=\"\",\"\",DAY(A1339))","v":15},{"$f":"IFERROR(VLOOKUP(IF(A1339=\"\",\"\",MONTH(A1339)),$P$3:$Q$14,2,FALSE),\"\")","v":"Marzec"},{"$f":"IF(A1339=\"\",\"\",YEAR(A1339))","v":2018},{"$f":"H1339","v":"Marzec"}]
["2018-03-15","I","346F",400,null,400,15,"Marzec",2018,"Marzec"]
["2018-03-15","I","718F",26,null,26,15,"Marzec",2018,"Marzec"]
["2018-03-15","I",634,360,5,365,15,"Marzec",2018,"Marzec"]
["2018-03-15","I",37,90,null,90,15,"Marzec",2018,"Marzec"]
["2018-03-15","I",593,80,null,80,15,"Marzec",2018,"Marzec"]
["2018-03-15","I",761,60,65,125,15,"Marzec",2018,"Marzec"]
["2018-03-15","I",326,2195,3,2198,15,"Marzec",2018,"Marzec"]
["2018-03-15","I",498,994,null,994,15,"Marzec",2018,"Marzec"]
["2018-03-15","I",2432300,800,30,830,15,"Marzec",2018,"Marzec"]
["2018-03-15","I","300F",260,4,264,15,"Marzec",2018,"Marzec"]
["2018-03-15","III",431,386,20,{"$f":"IF(A1350=\"\",\"\",D1350+E1350)","v":406},{"$f":"IF(A1350=\"\",\"\",DAY(A1350))","v":15},{"$f":"IFERROR(VLOOKUP(IF(A1350=\"\",\"\",MONTH(A1350)),$P$3:$Q$14,2,FALSE),\"\")","v":"Marzec"},{"$f":"IF(A1350=\"\",\"\",YEAR(A1350))","v":2018},{"$f":"H1350","v":"Marzec"}]
["2018-03-15","III",498,2312,null,2312,15,"Marzec",2018,"Marzec"]
["2018-03-15","III",2451636,60,null,60,15,"Marzec",2018,"Marzec"]
["2018-03-16","I",2297015,143,null,143,16,"Marzec",2018,"Marzec"]
["2018-03-16","I",1901726,210,null,210,16,"Marzec",2018,"Marzec"]
["2018-03-16","I","334F",813,6,819,16,"Marzec",2018,"Marzec"]
["2018-03-16","I",701,12,null,12,16,"Marzec",2018,"Marzec"]
["2018-03-16","I",812,910,null,910,16,"Marzec",2018,"Marzec"]
["2018-03-16","I",48,80,null,80,16,"Marzec",2018,"Marzec"]
["2018-03-16","I",319,20,null,20,16,"Marzec",2018,"Marzec"]
["2018-03-16","I",2001723,12,null,12,16,"Marzec",2018,"Marzec"]
["2018-03-16","I",369,18,null,18,16,"Marzec",2018,"Marzec"]
["2018-03-16","I",554,10,null,10,16,"Marzec",2018,"Marzec"]
["2018-03-16","I",326,2882,9,2891,16,"Marzec",2018,"Marzec"]
["2018-03-16","I","717F",520,6,526,16,"Marzec",2018,"Marzec"]
["2018-03-16","I",2310044,624,null,624,16,"Marzec",2018,"Marzec"]
["2018-03-16","II",1533713,211,6,{"$f":"IF(A1366=\"\",\"\",D1366+E1366)","v":217},{"$f":"IF(A1366=\"\",\"\",DAY(A1366))","v":16},{"$f":"IFERROR(VLOOKUP(IF(A1366=\"\",\"\",MONTH(A1366)),$P$3:$Q$14,2,FALSE),\"\")","v":"Marzec"},{"$f":"IF(A1366=\"\",\"\",YEAR(A1366))","v":2018},{"$f":"H1366","v":"Marzec"}]
["2018-03-16","II",119,560,1023,1583,16,"Marzec",2018,"Marzec"]
["2018-03-16","II",356,260,187,447,16,"Marzec",2018,"Marzec"]
["2018-03-16","II",2297015,351,88,439,16,"Marzec",2018,"Marzec"]
["2018-03-16","III",326,2224,2,2226,16,"Marzec",2018,"Marzec"]
["2018-03-16","III",26144994,190,null,190,16,"Marzec",2018,"Marzec"]
["2018-03-16","III",22,240,null,240,16,"Marzec",2018,"Marzec"]
["2018-03-16","III",2237976,480,null,480,16,"Marzec",2018,"Marzec"]
["2018-03-17","I",26144994,601,null,{"$f":"IF(A1374=\"\",\"\",D1374+E1374)","v":601},{"$f":"IF(A1374=\"\",\"\",DAY(A1374))","v":17},{"$f":"IFERROR(VLOOKUP(IF(A1374=\"\",\"\",MONTH(A1374)),$P$3:$Q$14,2,FALSE),\"\")","v":"Marzec"},{"$f":"IF(A1374=\"\",\"\",YEAR(A1374))","v":2018},{"$f":"H1374","v":"Marzec"}]
["2018-03-17","I",498,199,null,199,17,"Marzec",2018,"Marzec"]
["2018-03-17","I",560,20,null,20,17,"Marzec",2018,"Marzec"]
["2018-03-17","I",2432300,46,null,46,17,"Marzec",2018,"Marzec"]
["2018-03-17","I",787,185,null,185,17,"Marzec",2018,"Marzec"]
["2018-03-17","I",733,10,null,10,17,"Marzec",2018,"Marzec"]
["2018-03-17","I",797,8,null,8,17,"Marzec",2018,"Marzec"]
["2018-03-17","I",1745895,35,null,35,17,"Marzec",2018,"Marzec"]
["2018-03-17","I",160,251,null,251,17,"Marzec",2018,"Marzec"]
["2018-03-17","I",2035613,147,null,147,17,"Marzec",2018,"Marzec"]
["2018-03-17","I","33503F",1387,12,1399,17,"Marzec",2018,"Marzec"]
["2018-03-17","I",1901726,93,null,93,17,"Marzec",2018,"Marzec"]
["2018-03-17","I","721F",343,7,350,17,"Marzec",2018,"Marzec"]
["2018-03-17","I",812,590,6,596,17,"Marzec",2018,"Marzec"]
["2018-03-19","I",119,49,null,{"$f":"IF(A1388=\"\",\"\",D1388+E1388)","v":49},{"$f":"IF(A1388=\"\",\"\",DAY(A1388))","v":19},{"$f":"IFERROR(VLOOKUP(IF(A1388=\"\",\"\",MONTH(A1388)),$P$3:$Q$14,2,FALSE),\"\")","v":"Marzec"},{"$f":"IF(A1388=\"\",\"\",YEAR(A1388))","v":2018},{"$f":"H1388","v":"Marzec"}]
["2018-03-19","I",2030723,817,null,817,19,"Marzec",2018,"Marzec"]
["2018-03-19","I","33501F",428,3,431,19,"Marzec",2018,"Marzec"]
["2018-03-19","I",31,1,null,1,19,"Marzec",2018,"Marzec"]
["2018-03-19","I",2310044,6,null,6,19,"Marzec",2018,"Marzec"]
["2018-03-19","I",944,2,null,2,19,"Marzec",2018,"Marzec"]
["2018-03-19","I",101,2,null,2,19,"Marzec",2018,"Marzec"]
["2018-03-19","I",498,1804,null,1804,19,"Marzec",2018,"Marzec"]
["2018-03-19","I",812,923,null,923,19,"Marzec",2018,"Marzec"]
["2018-03-19","I",570,312,1,313,19,"Marzec",2018,"Marzec"]
["2018-03-19","I",252,295,null,295,19,"Marzec",2018,"Marzec"]
["2018-03-19","I","716F",541,20,561,19,"Marzec",2018,"Marzec"]
["2018-03-19","I",119,49,null,{"$f":"IF(A1400=\"\",\"\",D1400+E1400)","v":49},{"$f":"IF(A1400=\"\",\"\",DAY(A1400))","v":19},{"$f":"IFERROR(VLOOKUP(IF(A1400=\"\",\"\",MONTH(A1400)),$P$3:$Q$14,2,FALSE),\"\")","v":"Marzec"},{"$f":"IF(A1400=\"\",\"\",YEAR(A1400))","v":2018},{"$f":"H1400","v":"Marzec"}]
["2018-03-19","I",2030723,817,null,817,19,"Marzec",2018,"Marzec"]
["2018-03-19","I","33501F",428,3,431,19,"Marzec",2018,"Marzec"]
["2018-03-19","I",31,1,null,1,19,"Marzec",2018,"Marzec"]
["2018-03-19","I",2310044,6,null,6,19,"Marzec",2018,"Marzec"]
["2018-03-19","I",944,2,null,2,19,"Marzec",2018,"Marzec"]
["2018-03-19","I",101,2,null,2,19,"Marzec",2018,"Marzec"]
["2018-03-19","I",498,1804,null,1804,19,"Marzec",2018,"Marzec"]
["2018-03-19","I",812,923,null,923,19,"Marzec",2018,"Marzec"]
["2018-03-19","I",570,312,1,313,19,"Marzec",2018,"Marzec"]
["2018-03-19","I",252,295,null,295,19,"Marzec",2018,"Marzec"]
["2018-03-19","I","716F",541,20,561,19,"Marzec",2018,"Marzec"]
["2018-03-19","II",702,8,null,{"$f":"IF(A1412=\"\",\"\",D1412+E1412)","v":8},{"$f":"IF(A1412=\"\",\"\",DAY(A1412))","v":19},{"$f":"IFERROR(VLOOKUP(IF(A1412=\"\",\"\",MONTH(A1412)),$P$3:$Q$14,2,FALSE),\"\")","v":"Marzec"},{"$f":"IF(A1412=\"\",\"\",YEAR(A1412))","v":2018},{"$f":"H1412","v":"Marzec"}]
["2018-03-19","II",933,500,null,500,19,"Marzec",2018,"Marzec"]
["2018-03-19","II",2375097,306,156,462,19,"Marzec",2018,"Marzec"]
["2018-03-19","II",498,2581,5,2586,19,"Marzec",2018,"Marzec"]
["2018-03-19","III",76,1052,null,1052,19,"Marzec",2018,"Marzec"]
["2018-03-19","III",202,228,3,231,19,"Marzec",2018,"Marzec"]
["2018-03-19","III",2451636,180,null,180,19,"Marzec",2018,"Marzec"]
["2018-03-19","III",498,2398,null,2398,19,"Marzec",2018,"Marzec"]
["2018-03-19","III",709,7,null,7,19,"Marzec",2018,"Marzec"]
["2018-03-20","I","33503F",240,null,{"$f":"IF(A1421=\"\",\"\",D1421+E1421)","v":240},{"$f":"IF(A1421=\"\",\"\",DAY(A1421))","v":20},{"$f":"IFERROR(VLOOKUP(IF(A1421=\"\",\"\",MONTH(A1421)),$P$3:$Q$14,2,FALSE),\"\")","v":"Marzec"},{"$f":"IF(A1421=\"\",\"\",YEAR(A1421))","v":2018},{"$f":"H1421","v":"Marzec"}]
["2018-03-20","I",2651043,8,null,8,20,"Marzec",2018,"Marzec"]
["2018-03-20","I","716F",218,13,231,20,"Marzec",2018,"Marzec"]
["2018-03-20","I","710F",60,3,63,20,"Marzec",2018,"Marzec"]
["2018-03-20","I",319,20,null,20,20,"Marzec",2018,"Marzec"]
["2018-03-20","I",2297015,90,null,90,20,"Marzec",2018,"Marzec"]
["2018-03-20","I",562,101,null,101,20,"Marzec",2018,"Marzec"]
["2018-03-20","I",2659560,502,null,502,20,"Marzec",2018,"Marzec"]
["2018-03-20","I",498,3115,5,3120,20,"Marzec",2018,"Marzec"]
["2018-03-20","I",2310044,432,null,432,20,"Marzec",2018,"Marzec"]
["2018-03-20","I",570,380,2,382,20,"Marzec",2018,"Marzec"]
["2018-03-20","I",616,5,null,5,20,"Marzec",2018,"Marzec"]
["2018-03-20","I",617,5,null,5,20,"Marzec",2018,"Marzec"]
["2018-03-20","I","717F",419,15,434,20,"Marzec",2018,"Marzec"]
["2018-03-20","II",2632895,40,null,{"$f":"IF(A1435=\"\",\"\",D1435+E1435)","v":40},{"$f":"IF(A1435=\"\",\"\",DAY(A1435))","v":20},{"$f":"IFERROR(VLOOKUP(IF(A1435=\"\",\"\",MONTH(A1435)),$P$3:$Q$14,2,FALSE),\"\")","v":"Marzec"},{"$f":"IF(A1435=\"\",\"\",YEAR(A1435))","v":2018},{"$f":"H1435","v":"Marzec"}]
["2018-03-20","II",570,91,null,91,20,"Marzec",2018,"Marzec"]
["2018-03-20","II",2149709,59,null,59,20,"Marzec",2018,"Marzec"]
["2018-03-20","II",546,30,null,30,20,"Marzec",2018,"Marzec"]
["2018-03-20","II",498,1995,null,1995,20,"Marzec",2018,"Marzec"]
["2018-03-20","II",2310044,408,null,408,20,"Marzec",2018,"Marzec"]
["2018-03-20","II",69,432,4,436,20,"Marzec",2018,"Marzec"]
["2018-03-20","III",326,2387,6,2393,20,"Marzec",2018,"Marzec"]
["2018-03-20","III",15,176,53,229,20,"Marzec",2018,"Marzec"]
["2018-03-20","III",2451635,390,null,390,20,"Marzec",2018,"Marzec"]
["2018-03-20","III",933,191,1,192,20,"Marzec",2018,"Marzec"]
["2018-03-21","I",2067417,10,null,{"$f":"IF(A1446=\"\",\"\",D1446+E1446)","v":10},{"$f":"IF(A1446=\"\",\"\",DAY(A1446))","v":21},{"$f":"IFERROR(VLOOKUP(IF(A1446=\"\",\"\",MONTH(A1446)),$P$3:$Q$14,2,FALSE),\"\")","v":"Marzec"},{"$f":"IF(A1446=\"\",\"\",YEAR(A1446))","v":2018},{"$f":"H1446","v":"Marzec"}]
["2018-03-21","I",242,99,null,99,21,"Marzec",2018,"Marzec"]
["2018-03-21","I",319,72,41,113,21,"Marzec",2018,"Marzec"]
["2018-03-21","I",571,288,null,288,21,"Marzec",2018,"Marzec"]
["2018-03-21","I",47,30,null,30,21,"Marzec",2018,"Marzec"]
["2018-03-21","I",415,10,null,10,21,"Marzec",2018,"Marzec"]
["2018-03-21","I",701,81,1,82,21,"Marzec",2018,"Marzec"]
["2018-03-21","I","33501F",1072,4,1076,21,"Marzec",2018,"Marzec"]
["2018-03-21","I",326,2741,6,2747,21,"Marzec",2018,"Marzec"]
["2018-03-21","I",2451636,210,null,210,21,"Marzec",2018,"Marzec"]
["2018-03-21","II","33503F",80,null,{"$f":"IF(A1456=\"\",\"\",D1456+E1456)","v":80},{"$f":"IF(A1456=\"\",\"\",DAY(A1456))","v":21},{"$f":"IFERROR(VLOOKUP(IF(A1456=\"\",\"\",MONTH(A1456)),$P$3:$Q$14,2,FALSE),\"\")","v":"Marzec"},{"$f":"IF(A1456=\"\",\"\",YEAR(A1456))","v":2018},{"$f":"H1456","v":"Marzec"}]
["2018-03-21","II",498,1070,5,1075,21,"Marzec",2018,"Marzec"]
["2018-03-21","II",2408708,408,28,436,21,"Marzec",2018,"Marzec"]
["2018-03-21","III",269,34,39,73,21,"Marzec",2018,"Marzec"]
["2018-03-21","III",966,56,null,56,21,"Marzec",2018,"Marzec"]
["2018-03-21","III",2007977,60,null,60,21,"Marzec",2018,"Marzec"]
["2018-03-21","III",2451636,120,null,120,21,"Marzec",2018,"Marzec"]
["2018-03-21","III",498,2381,4,2385,21,"Marzec",2018,"Marzec"]
["2018-03-22","I","717F",68,6,{"$f":"IF(A1464=\"\",\"\",D1464+E1464)","v":74},{"$f":"IF(A1464=\"\",\"\",DAY(A1464))","v":22},{"$f":"IFERROR(VLOOKUP(IF(A1464=\"\",\"\",MONTH(A1464)),$P$3:$Q$14,2,FALSE),\"\")","v":"Marzec"},{"$f":"IF(A1464=\"\",\"\",YEAR(A1464))","v":2018},{"$f":"H1464","v":"Marzec"}]
["2018-03-22","I",2297015,52,null,52,22,"Marzec",2018,"Marzec"]
["2018-03-22","I",2408708,17,null,17,22,"Marzec",2018,"Marzec"]
["2018-03-22","I",416,20,null,20,22,"Marzec",2018,"Marzec"]
["2018-03-22","I",2067417,10,null,10,22,"Marzec",2018,"Marzec"]
["2018-03-22","I",418,10,null,10,22,"Marzec",2018,"Marzec"]
["2018-03-22","I",498,2391,1,2392,22,"Marzec",2018,"Marzec"]
["2018-03-22","I",497,6,null,6,22,"Marzec",2018,"Marzec"]
["2018-03-22","I",529,6,null,6,22,"Marzec",2018,"Marzec"]
["2018-03-22","I",812,726,34,760,22,"Marzec",2018,"Marzec"]
["2018-03-22","I",2432300,460,35,495,22,"Marzec",2018,"Marzec"]
["2018-03-22","I",179,960,41,1001,22,"Marzec",2018,"Marzec"]
["2018-03-22","I","334F",163,null,163,22,"Marzec",2018,"Marzec"]
["2018-03-22","II",2418977,18,null,{"$f":"IF(A1477=\"\",\"\",D1477+E1477)","v":18},{"$f":"IF(A1477=\"\",\"\",DAY(A1477))","v":22},{"$f":"IFERROR(VLOOKUP(IF(A1477=\"\",\"\",MONTH(A1477)),$P$3:$Q$14,2,FALSE),\"\")","v":"Marzec"},{"$f":"IF(A1477=\"\",\"\",YEAR(A1477))","v":2018},{"$f":"H1477","v":"Marzec"}]
["2018-03-22","II",142,59,2,61,22,"Marzec",2018,"Marzec"]
["2018-03-22","II",498,1543,61,1604,22,"Marzec",2018,"Marzec"]
["2018-03-22","II",2418976,116,null,116,22,"Marzec",2018,"Marzec"]
["2018-03-22","II",845,20,2,22,22,"Marzec",2018,"Marzec"]
["2018-03-22","II",21,40,null,40,22,"Marzec",2018,"Marzec"]
["2018-03-22","II",894,120,null,120,22,"Marzec",2018,"Marzec"]
["2018-03-22","II",31,348,null,{"$f":"IF(A1484=\"\",\"\",D1484+E1484)","v":348},{"$f":"IF(A1484=\"\",\"\",DAY(A1484))","v":22},{"$f":"IFERROR(VLOOKUP(IF(A1484=\"\",\"\",MONTH(A1484)),$P$3:$Q$14,2,FALSE),\"\")","v":"Marzec"},{"$f":"IF(A1484=\"\",\"\",YEAR(A1484))","v":2018},{"$f":"H1484","v":"Marzec"}]
["2018-03-22","II",2007977,71,null,71,22,"Marzec",2018,"Marzec"]
["2018-03-22","II",269,40,null,40,22,"Marzec",2018,"Marzec"]
["2018-03-22","II",575,120,null,120,22,"Marzec",2018,"Marzec"]
["2018-03-22","II",641,300,null,300,22,"Marzec",2018,"Marzec"]
["2018-03-22","III",31,240,null,240,22,"Marzec",2018,"Marzec"]
["2018-03-22","III",2007977,71,7,78,22,"Marzec",2018,"Marzec"]
["2018-03-22","III",269,40,5,45,22,"Marzec",2018,"Marzec"]
["2018-03-22","III",575,134,null,134,22,"Marzec",2018,"Marzec"]
["2018-03-22","III",933,309,null,309,22,"Marzec",2018,"Marzec"]
["2018-03-22","III",498,2386,7,2393,22,"Marzec",2018,"Marzec"]

{"sheet":"Wskaźniki","index":2,"n_rows":191,"n_cols":27,"rows_kept":191,"cut":false,"hidden":false,"merged":[]}
["Dzień","Nr tygodnia","Miesiąc","Rok","Data","Zmiana","Planowana produkcja","Zrealizowana produkcja","Suma godzin na zmianę \n[h]","Suma godzin normatywnych (zakładanych)","Obciążenie [%]","Faktyczny czas realizacji [h]","Faktyczne obciążenie","Wsp. pakowania przy 7,5h [szt/min]","Wsp. pakowania przy 7,5h [min/szt]","Wsp. pakowania przy 7,5h [s/szt]","Wsp. pakowania przy 8h [szt/min]","Wsp. pakowania przy 8h [min/szt]","Wsp. pakowania przy 8h [s/szt]","Ilość sztuk","Suma czasu z przerwami (s)","Cel miesięczny (s/szt.) ","Czy numer tygodnia jest parzysty","A","B","C","Zmiana:"]
[{"$f":"IF(E2=\"\",\"\",TEXT(WEEKDAY(IF(E2=0,\"\",E2),1),\"dddd\"))","v":"środa"},{"$f":"IF(E2=\"\",\"\",WEEKNUM(IF(E2=0,\"\",E2),1))","v":1},{"$f":"IF(E2=\"\",\"\",TEXT(IF(E2=0,\"\",MONTH(E2))*30,\"mmmm\"))","v":"styczeń"},{"$f":"YEAR(Tabela2[[#This Row],[Data]])","v":2018},"2018-01-03","I",4942,3749,30,36.084913961801753,1.2028304653933917,34.757362903671336,1.1585787634557112,2.6816666666666666,0.37290242386575512,22,2.5140625000000001,0.39776258545680548,24,{"$f":"IF(E2=\"\",\"\",I2*60*N2)","v":4827},{"$f":"IF(E2=\"\",\"\",(I2+I2/7.5*0.5)*3600)","v":115200},{"$f":"IF(E2=\"\",\"\",40/1.2)","v":33.333333333333336},{"$f":"IF(B2=\"\",\"\",ISEVEN(B2))","v":false},{"$f":"IF(B2=\"\",\"\",IF(W2=TRUE,IF(F2=\"I\",\"TAK\",\"NIE\"),IF(F2=\"I\",\"NIE\",IF(F2=\"III\",\"NIE\",\"TAK\"))))","v":"NIE"},{"$f":"IF(B2=\"\",\"\",IF(AND(X2=\"NIE\",Z2=\"NIE\"),\"TAK\",\"NIE\"))","v":"TAK"},{"$f":"IF(B2=\"\",\"\",IF(F2=\"III\",\"TAK\",\"NIE\"))","v":"NIE"},{"$f":"IF(E2=\"\",\"\",IF(X2=\"TAK\",\"Zmiana A\",IF(Y2=\"TAK\",\"Zmiana B\",\"Zmiana C\")))","v":"Zmiana B"}]
["środa",1,"styczeń",{"$f":"YEAR(Tabela2[[#This Row],[Data]])","v":2018},"2018-01-03","II",17984,17715,22.5,27.940176151761513,1.2417856067449562,29.814795499348243,1.3251020221932552,1.0437037037037038,0.95812633073101494,57,0.97847222222222219,1.022001419446416,61,{"$f":"IF(E3=\"\",\"\",I3*60*N3)","v":1409.0000000000002},{"$f":"IF(E3=\"\",\"\",(I3+I3/7.5*0.5)*3600)","v":86400},{"$f":"IF(E3=\"\",\"\",40/1.2)","v":33.333333333333336},{"$f":"IF(B3=\"\",\"\",ISEVEN(B3))","v":false},{"$f":"IF(B3=\"\",\"\",IF(W3=TRUE,IF(F3=\"I\",\"TAK\",\"NIE\"),IF(F3=\"I\",\"NIE\",IF(F3=\"III\",\"NIE\",\"TAK\"))))","v":"TAK"},{"$f":"IF(B3=\"\",\"\",IF(AND(X3=\"NIE\",Z3=\"NIE\"),\"TAK\",\"NIE\"))","v":"NIE"},{"$f":"IF(B3=\"\",\"\",IF(F3=\"III\",\"TAK\",\"NIE\"))","v":"NIE"},{"$f":"IF(E3=\"\",\"\",IF(X3=\"TAK\",\"Zmiana A\",IF(Y3=\"TAK\",\"Zmiana B\",\"Zmiana C\")))","v":"Zmiana A"}]
["środa",1,"styczeń",{"$f":"YEAR(Tabela2[[#This Row],[Data]])","v":2018},"2018-01-03","III",5354,4633,22.5,31.716247379454924,1.4096109946424411,33.266289849443417,1.4785017710863742,2.3518518518518516,0.42519685039370081,26,2.2048611111111112,0.45354330708661417,27,{"$f":"IF(E4=\"\",\"\",I4*60*N4)","v":3174.9999999999995},{"$f":"IF(E4=\"\",\"\",(I4+I4/7.5*0.5)*3600)","v":86400},{"$f":"IF(E4=\"\",\"\",40/1.2)","v":33.333333333333336},{"$f":"IF(B4=\"\",\"\",ISEVEN(B4))","v":false},{"$f":"IF(B4=\"\",\"\",IF(W4=TRUE,IF(F4=\"I\",\"TAK\",\"NIE\"),IF(F4=\"I\",\"NIE\",IF(F4=\"III\",\"NIE\",\"TAK\"))))","v":"NIE"},{"$f":"IF(B4=\"\",\"\",IF(AND(X4=\"NIE\",Z4=\"NIE\"),\"TAK\",\"NIE\"))","v":"NIE"},{"$f":"IF(B4=\"\",\"\",IF(F4=\"III\",\"TAK\",\"NIE\"))","v":"TAK"},{"$f":"IF(E4=\"\",\"\",IF(X4=\"TAK\",\"Zmiana A\",IF(Y4=\"TAK\",\"Zmiana B\",\"Zmiana C\")))","v":"Zmiana C"}]
["piątek",1,"styczeń",{"$f":"YEAR(Tabela2[[#This Row],[Data]])","v":2018},"2018-01-05","I",2733,1707,37.5,36.373566017316016,0.96996176046176041,38.072489053886578,1.0152663747703088,1.92,0.52083333333333337,31,1.8,0.55555555555555558,33,{"$f":"IF(E5=\"\",\"\",I5*60*N5)","v":4320},{"$f":"IF(E5=\"\",\"\",(I5+I5/7.5*0.5)*3600)","v":144000},{"$f":"IF(E5=\"\",\"\",40/1.2)","v":33.333333333333336},{"$f":"IF(B5=\"\",\"\",ISEVEN(B5))","v":false},{"$f":"IF(B5=\"\",\"\",IF(W5=TRUE,IF(F5=\"I\",\"TAK\",\"NIE\"),IF(F5=\"I\",\"NIE\",IF(F5=\"III\",\"NIE\",\"TAK\"))))","v":"NIE"},{"$f":"IF(B5=\"\",\"\",IF(AND(X5=\"NIE\",Z5=\"NIE\"),\"TAK\",\"NIE\"))","v":"TAK"},{"$f":"IF(B5=\"\",\"\",IF(F5=\"III\",\"TAK\",\"NIE\"))","v":"NIE"},{"$f":"IF(E5=\"\",\"\",IF(X5=\"TAK\",\"Zmiana A\",IF(Y5=\"TAK\",\"Zmiana B\",\"Zmiana C\")))","v":"Zmiana B"}]
["piątek",1,"styczeń",{"$f":"YEAR(Tabela2[[#This Row],[Data]])","v":2018},"2018-01-05","II",6274,4320,22.5,16.710282953761215,0.74267924238938732,15.850199664104323,0.70445331840463665,1.2644444444444445,0.79086115992970119,47,1.1854166666666666,0.843585237258348,51,{"$f":"IF(E6=\"\",\"\",I6*60*N6)","v":1707},{"$f":"IF(E6=\"\",\"\",(I6+I6/7.5*0.5)*3600)","v":86400},{"$f":"IF(E6=\"\",\"\",40/1.2)","v":33.333333333333336},{"$f":"IF(B6=\"\",\"\",ISEVEN(B6))","v":false},{"$f":"IF(B6=\"\",\"\",IF(W6=TRUE,IF(F6=\"I\",\"TAK\",\"NIE\"),IF(F6=\"I\",\"NIE\",IF(F6=\"III\",\"NIE\",\"TAK\"))))","v":"TAK"},{"$f":"IF(B6=\"\",\"\",IF(AND(X6=\"NIE\",Z6=\"NIE\"),\"TAK\",\"NIE\"))","v":"NIE"},{"$f":"IF(B6=\"\",\"\",IF(F6=\"III\",\"TAK\",\"NIE\"))","v":"NIE"},{"$f":"IF(E6=\"\",\"\",IF(X6=\"TAK\",\"Zmiana A\",IF(Y6=\"TAK\",\"Zmiana B\",\"Zmiana C\")))","v":"Zmiana A"}]
["piątek",1,"styczeń",{"$f":"YEAR(Tabela2[[#This Row],[Data]])","v":2018},"2018-01-05","III",5060,3800,22.5,27.962481962481966,1.2427769761103096,29.011390959180211,1.2893951537413426,2.8148148148148149,0.35526315789473684,21,2.6388888888888888,0.37894736842105264,23,{"$f":"IF(E7=\"\",\"\",I7*60*N7)","v":3800},{"$f":"IF(E7=\"\",\"\",(I7+I7/7.5*0.5)*3600)","v":86400},{"$f":"IF(E7=\"\",\"\",40/1.2)","v":33.333333333333336},{"$f":"IF(B7=\"\",\"\",ISEVEN(B7))","v":false},{"$f":"IF(B7=\"\",\"\",IF(W7=TRUE,IF(F7=\"I\",\"TAK\",\"NIE\"),IF(F7=\"I\",\"NIE\",IF(F7=\"III\",\"NIE\",\"TAK\"))))","v":"NIE"},{"$f":"IF(B7=\"\",\"\",IF(AND(X7=\"NIE\",Z7=\"NIE\"),\"TAK\",\"NIE\"))","v":"NIE"},{"$f":"IF(B7=\"\",\"\",IF(F7=\"III\",\"TAK\",\"NIE\"))","v":"TAK"},{"$f":"IF(E7=\"\",\"\",IF(X7=\"TAK\",\"Zmiana A\",IF(Y7=\"TAK\",\"Zmiana B\",\"Zmiana C\")))","v":"Zmiana C"}]
["poniedziałek",2,"styczeń",{"$f":"YEAR(Tabela2[[#This Row],[Data]])","v":2018},"2018-01-08","I",6302,4103,30,28.488202439522482,0.94960674798408273,30.367715189854337,1.0122571729951446,2.2794444444444446,0.43870338776504997,26,2.1369791666666669,0.46795028028271995,28,{"$f":"IF(E8=\"\",\"\",I8*60*N8)","v":4103},{"$f":"IF(E8=\"\",\"\",(I8+I8/7.5*0.5)*3600)","v":115200},{"$f":"IF(E8=\"\",\"\",40/1.2)","v":33.333333333333336},{"$f":"IF(B8=\"\",\"\",ISEVEN(B8))","v":true},{"$f":"IF(B8=\"\",\"\",IF(W8=TRUE,IF(F8=\"I\",\"TAK\",\"NIE\"),IF(F8=\"I\",\"NIE\",IF(F8=\"III\",\"NIE\",\"TAK\"))))","v":"TAK"},{"$f":"IF(B8=\"\",\"\",IF(AND(X8=\"NIE\",Z8=\"NIE\"),\"TAK\",\"NIE\"))","v":"NIE"},{"$f":"IF(B8=\"\",\"\",IF(F8=\"III\",\"TAK\",\"NIE\"))","v":"NIE"},{"$f":"IF(E8=\"\",\"\",IF(X8=\"TAK\",\"Zmiana A\",IF(Y8=\"TAK\",\"Zmiana B\",\"Zmiana C\")))","v":"Zmiana A"}]
["poniedziałek",2,"styczeń",{"$f":"YEAR(Tabela2[[#This Row],[Data]])","v":2018},"2018-01-08","II",7028,5062,37.5,34.699797713166284,0.92532793901776755,36.3829731015256,0.97021261604068265,2.2497777777777777,0.44448834452785463,27,2.1091666666666669,0.47412090082971159,28,{"$f":"IF(E9=\"\",\"\",I9*60*N9)","v":5062},{"$f":"IF(E9=\"\",\"\",(I9+I9/7.5*0.5)*3600)","v":144000},{"$f":"IF(E9=\"\",\"\",40/1.2)","v":33.333333333333336},{"$f":"IF(B9=\"\",\"\",ISEVEN(B9))","v":true},{"$f":"IF(B9=\"\",\"\",IF(W9=TRUE,IF(F9=\"I\",\"TAK\",\"NIE\"),IF(F9=\"I\",\"NIE\",IF(F9=\"III\",\"NIE\",\"TAK\"))))","v":"NIE"},{"$f":"IF(B9=\"\",\"\",IF(AND(X9=\"NIE\",Z9=\"NIE\"),\"TAK\",\"NIE\"))","v":"TAK"},{"$f":"IF(B9=\"\",\"\",IF(F9=\"III\",\"TAK\",\"NIE\"))","v":"NIE"},{"$f":"IF(E9=\"\",\"\",IF(X9=\"TAK\",\"Zmiana A\",IF(Y9=\"TAK\",\"Zmiana B\",\"Zmiana C\")))","v":"Zmiana B"}]
["poniedziałek",2,"styczeń",{"$f":"YEAR(Tabela2[[#This Row],[Data]])","v":2018},"2018-01-08","III",2933,2583,15,17.597069597069595,1.173137973137973,17.29375815311014,1.1529172102073426,2.87,0.34843205574912894,21,2.6906249999999998,0.37166085946573751,22,{"$f":"IF(E10=\"\",\"\",I10*60*N10)","v":2583},{"$f":"IF(E10=\"\",\"\",(I10+I10/7.5*0.5)*3600)","v":57600},{"$f":"IF(E10=\"\",\"\",40/1.2)","v":33.333333333333336},{"$f":"IF(B10=\"\",\"\",ISEVEN(B10))","v":true},{"$f":"IF(B10=\"\",\"\",IF(W10=TRUE,IF(F10=\"I\",\"TAK\",\"NIE\"),IF(F10=\"I\",\"NIE\",IF(F10=\"III\",\"NIE\",\"TAK\"))))","v":"NIE"},{"$f":"IF(B10=\"\",\"\",IF(AND(X10=\"NIE\",Z10=\"NIE\"),\"TAK\",\"NIE\"))","v":"NIE"},{"$f":"IF(B10=\"\",\"\",IF(F10=\"III\",\"TAK\",\"NIE\"))","v":"TAK"},{"$f":"IF(E10=\"\",\"\",IF(X10=\"TAK\",\"Zmiana A\",IF(Y10=\"TAK\",\"Zmiana B\",\"Zmiana C\")))","v":"Zmiana C"}]
["wtorek",2,"styczeń",{"$f":"YEAR(Tabela2[[#This Row],[Data]])","v":2018},"2018-01-09","I",6120,4764,45,44.139983033030973,0.9808885118451327,42.798848112541016,0.95108551361202254,1.7644444444444445,0.56675062972292189,34,1.6541666666666666,0.60453400503778343,36,{"$f":"IF(E11=\"\",\"\",I11*60*N11)","v":4764},{"$f":"IF(E11=\"\",\"\",(I11+I11/7.5*0.5)*3600)","v":172800},{"$f":"IF(E11=\"\",\"\",40/1.2)","v":33.333333333333336},{"$f":"IF(B11=\"\",\"\",ISEVEN(B11))","v":true},{"$f":"IF(B11=\"\",\"\",IF(W11=TRUE,IF(F11=\"I\",\"TAK\",\"NIE\"),IF(F11=\"I\",\"NIE\",IF(F11=\"III\",\"NIE\",\"TAK\"))))","v":"TAK"},{"$f":"IF(B11=\"\",\"\",IF(AND(X11=\"NIE\",Z11=\"NIE\"),\"TAK\",\"NIE\"))","v":"NIE"},{"$f":"IF(B11=\"\",\"\",IF(F11=\"III\",\"TAK\",\"NIE\"))","v":"NIE"},{"$f":"IF(E11=\"\",\"\",IF(X11=\"TAK\",\"Zmiana A\",IF(Y11=\"TAK\",\"Zmiana B\",\"Zmiana C\")))","v":"Zmiana A"}]
["wtorek",2,"styczeń",{"$f":"YEAR(Tabela2[[#This Row],[Data]])","v":2018},"2018-01-09","II",4242,2957,22.5,30.655406746031744,1.3624625220458553,29.644419052356067,1.3175297356602695,2.1903703703703705,0.45654379438620224,27,2.0534722222222221,0.48698004734528239,29,{"$f":"IF(E12=\"\",\"\",I12*60*N12)","v":2957},{"$f":"IF(E12=\"\",\"\",(I12+I12/7.5*0.5)*3600)","v":86400},{"$f":"IF(E12=\"\",\"\",40/1.2)","v":33.333333333333336},{"$f":"IF(B12=\"\",\"\",ISEVEN(B12))","v":true},{"$f":"IF(B12=\"\",\"\",IF(W12=TRUE,IF(F12=\"I\",\"TAK\",\"NIE\"),IF(F12=\"I\",\"NIE\",IF(F12=\"III\",\"NIE\",\"TAK\"))))","v":"NIE"},{"$f":"IF(B12=\"\",\"\",IF(AND(X12=\"NIE\",Z12=\"NIE\"),\"TAK\",\"NIE\"))","v":"TAK"},{"$f":"IF(B12=\"\",\"\",IF(F12=\"III\",\"TAK\",\"NIE\"))","v":"NIE"},{"$f":"IF(E12=\"\",\"\",IF(X12=\"TAK\",\"Zmiana A\",IF(Y12=\"TAK\",\"Zmiana B\",\"Zmiana C\")))","v":"Zmiana B"}]
["wtorek",2,"styczeń",{"$f":"YEAR(Tabela2[[#This Row],[Data]])","v":2018},"2018-01-09","III",4230,2861,15,16.216584680278899,1.0811056453519265,15.217794102636589,1.0145196068424391,3.1788888888888889,0.31457532331352672,19,2.9802083333333331,0.33554701153442851,20,{"$f":"IF(E13=\"\",\"\",I13*60*N13)","v":2861},{"$f":"IF(E13=\"\",\"\",(I13+I13/7.5*0.5)*3600)","v":57600},{"$f":"IF(E13=\"\",\"\",40/1.2)","v":33.333333333333336},{"$f":"IF(B13=\"\",\"\",ISEVEN(B13))","v":true},{"$f":"IF(B13=\"\",\"\",IF(W13=TRUE,IF(F13=\"I\",\"TAK\",\"NIE\"),IF(F13=\"I\",\"NIE\",IF(F13=\"III\",\"NIE\",\"TAK\"))))","v":"NIE"},{"$f":"IF(B13=\"\",\"\",IF(AND(X13=\"NIE\",Z13=\"NIE\"),\"TAK\",\"NIE\"))","v":"NIE"},{"$f":"IF(B13=\"\",\"\",IF(F13=\"III\",\"TAK\",\"NIE\"))","v":"TAK"},{"$f":"IF(E13=\"\",\"\",IF(X13=\"TAK\",\"Zmiana A\",IF(Y13=\"TAK\",\"Zmiana B\",\"Zmiana C\")))","v":"Zmiana C"}]
["środa",2,"styczeń",{"$f":"YEAR(Tabela2[[#This Row],[Data]])","v":2018},"2018-01-10","I",5619,4024,22.5,25.620141441651313,1.1386729529622805,26.498188785636696,1.1776972793616309,2.9807407407407407,0.33548707753479123,20,2.7944444444444443,0.35785288270377735,21,{"$f":"IF(E14=\"\",\"\",I14*60*N14)","v":4024},{"$f":"IF(E14=\"\",\"\",(I14+I14/7.5*0.5)*3600)","v":86400},{"$f":"IF(E14=\"\",\"\",40/1.2)","v":33.333333333333336},{"$f":"IF(B14=\"\",\"\",ISEVEN(B14))","v":true},{"$f":"IF(B14=\"\",\"\",IF(W14=TRUE,IF(F14=\"I\",\"TAK\",\"NIE\"),IF(F14=\"I\",\"NIE\",IF(F14=\"III\",\"NIE\",\"TAK\"))))","v":"TAK"},{"$f":"IF(B14=\"\",\"\",IF(AND(X14=\"NIE\",Z14=\"NIE\"),\"TAK\",\"NIE\"))","v":"NIE"},{"$f":"IF(B14=\"\",\"\",IF(F14=\"III\",\"TAK\",\"NIE\"))","v":"NIE"},{"$f":"IF(E14=\"\",\"\",IF(X14=\"TAK\",\"Zmiana A\",IF(Y14=\"TAK\",\"Zmiana B\",\"Zmiana C\")))","v":"Zmiana A"}]
["środa",2,"styczeń",{"$f":"YEAR(Tabela2[[#This Row],[Data]])","v":2018},"2018-01-10","II",4770,3147,37.5,28.312570000269488,0.75500186667385305,28.400174883727388,0.75733799689939696,1.3986666666666667,0.71496663489037182,43,1.31125,0.76263107721639656,46,{"$f":"IF(E15=\"\",\"\",I15*60*N15)","v":3147},{"$f":"IF(E15=\"\",\"\",(I15+I15/7.5*0.5)*3600)","v":144000},{"$f":"IF(E15=\"\",\"\",40/1.2)","v":33.333333333333336},{"$f":"IF(B15=\"\",\"\",ISEVEN(B15))","v":true},{"$f":"IF(B15=\"\",\"\",IF(W15=TRUE,IF(F15=\"I\",\"TAK\",\"NIE\"),IF(F15=\"I\",\"NIE\",IF(F15=\"III\",\"NIE\",\"TAK\"))))","v":"NIE"},{"$f":"IF(B15=\"\",\"\",IF(AND(X15=\"NIE\",Z15=\"NIE\"),\"TAK\",\"NIE\"))","v":"TAK"},{"$f":"IF(B15=\"\",\"\",IF(F15=\"III\",\"TAK\",\"NIE\"))","v":"NIE"},{"$f":"IF(E15=\"\",\"\",IF(X15=\"TAK\",\"Zmiana A\",IF(Y15=\"TAK\",\"Zmiana B\",\"Zmiana C\")))","v":"Zmiana B"}]
["środa",2,"styczeń",{"$f":"YEAR(Tabela2[[#This Row],[Data]])","v":2018},"2018-01-10","III",2880,2797,15,16.722113876997341,1.1148075917998228,17.455199457329456,1.1636799638219637,3.1077777777777778,0.32177332856632107,19,2.9135416666666667,0.34322488380407579,21,{"$f":"IF(E16=\"\",\"\",I16*60*N16)","v":2797},{"$f":"IF(E16=\"\",\"\",(I16+I16/7.5*0.5)*3600)","v":57600},{"$f":"IF(E16=\"\",\"\",40/1.2)","v":33.333333333333336},{"$f":"IF(B16=\"\",\"\",ISEVEN(B16))","v":true},{"$f":"IF(B16=\"\",\"\",IF(W16=TRUE,IF(F16=\"I\",\"TAK\",\"NIE\"),IF(F16=\"I\",\"NIE\",IF(F16=\"III\",\"NIE\",\"TAK\"))))","v":"NIE"},{"$f":"IF(B16=\"\",\"\",IF(AND(X16=\"NIE\",Z16=\"NIE\"),\"TAK\",\"NIE\"))","v":"NIE"},{"$f":"IF(B16=\"\",\"\",IF(F16=\"III\",\"TAK\",\"NIE\"))","v":"TAK"},{"$f":"IF(E16=\"\",\"\",IF(X16=\"TAK\",\"Zmiana A\",IF(Y16=\"TAK\",\"Zmiana B\",\"Zmiana C\")))","v":"Zmiana C"}]
["czwartek",2,"styczeń",{"$f":"YEAR(Tabela2[[#This Row],[Data]])","v":2018},"2018-01-11","I",5796,4487,37.5,35.800214419726608,0.95467238452604286,34.439951672227942,0.91839871125941175,1.9942222222222221,0.50144862937374635,30,1.8695833333333334,0.53487853799866281,32,{"$f":"IF(E17=\"\",\"\",I17*60*N17)","v":4487},{"$f":"IF(E17=\"\",\"\",(I17+I17/7.5*0.5)*3600)","v":144000},{"$f":"IF(E17=\"\",\"\",40/1.2)","v":33.333333333333336},{"$f":"IF(B17=\"\",\"\",ISEVEN(B17))","v":true},{"$f":"IF(B17=\"\",\"\",IF(W17=TRUE,IF(F17=\"I\",\"TAK\",\"NIE\"),IF(F17=\"I\",\"NIE\",IF(F17=\"III\",\"NIE\",\"TAK\"))))","v":"TAK"},{"$f":"IF(B17=\"\",\"\",IF(AND(X17=\"NIE\",Z17=\"NIE\"),\"TAK\",\"NIE\"))","v":"NIE"},{"$f":"IF(B17=\"\",\"\",IF(F17=\"III\",\"TAK\",\"NIE\"))","v":"NIE"},{"$f":"IF(E17=\"\",\"\",IF(X17=\"TAK\",\"Zmiana A\",IF(Y17=\"TAK\",\"Zmiana B\",\"Zmiana C\")))","v":"Zmiana A"}]
["czwartek",2,"styczeń",{"$f":"YEAR(Tabela2[[#This Row],[Data]])","v":2018},"2018-01-11","II",4868,3516,30,31.636988482531962,1.0545662827510653,33.516542296199475,1.1172180765399824,1.9533333333333334,0.51194539249146753,31,1.83125,0.5460750853242321,33,{"$f":"IF(E18=\"\",\"\",I18*60*N18)","v":3516},{"$f":"IF(E18=\"\",\"\",(I18+I18/7.5*0.5)*3600)","v":115200},{"$f":"IF(E18=\"\",\"\",40/1.2)","v":33.333333333333336},{"$f":"IF(B18=\"\",\"\",ISEVEN(B18))","v":true},{"$f":"IF(B18=\"\",\"\",IF(W18=TRUE,IF(F18=\"I\",\"TAK\",\"NIE\"),IF(F18=\"I\",\"NIE\",IF(F18=\"III\",\"NIE\",\"TAK\"))))","v":"NIE"},{"$f":"IF(B18=\"\",\"\",IF(AND(X18=\"NIE\",Z18=\"NIE\"),\"TAK\",\"NIE\"))","v":"TAK"},{"$f":"IF(B18=\"\",\"\",IF(F18=\"III\",\"TAK\",\"NIE\"))","v":"NIE"},{"$f":"IF(E18=\"\",\"\",IF(X18=\"TAK\",\"Zmiana A\",IF(Y18=\"TAK\",\"Zmiana B\",\"Zmiana C\")))","v":"Zmiana B"}]
["czwartek",2,"styczeń",{"$f":"YEAR(Tabela2[[#This Row],[Data]])","v":2018},"2018-01-11","III",3190,2851,15,16.678571428571427,1.1119047619047617,16.198959416947904,1.079930627796527,3.1677777777777778,0.31567870922483338,19,2.9697916666666666,0.33672395650648895,20,{"$f":"IF(E19=\"\",\"\",I19*60*N19)","v":2851},{"$f":"IF(E19=\"\",\"\",(I19+I19/7.5*0.5)*3600)","v":57600},{"$f":"IF(E19=\"\",\"\",40/1.2)","v":33.333333333333336},{"$f":"IF(B19=\"\",\"\",ISEVEN(B19))","v":true},{"$f":"IF(B19=\"\",\"\",IF(W19=TRUE,IF(F19=\"I\",\"TAK\",\"NIE\"),IF(F19=\"I\",\"NIE\",IF(F19=\"III\",\"NIE\",\"TAK\"))))","v":"NIE"},{"$f":"IF(B19=\"\",\"\",IF(AND(X19=\"NIE\",Z19=\"NIE\"),\"TAK\",\"NIE\"))","v":"NIE"},{"$f":"IF(B19=\"\",\"\",IF(F19=\"III\",\"TAK\",\"NIE\"))","v":"TAK"},{"$f":"IF(E19=\"\",\"\",IF(X19=\"TAK\",\"Zmiana A\",IF(Y19=\"TAK\",\"Zmiana B\",\"Zmiana C\")))","v":"Zmiana C"}]
["piątek",2,"styczeń",{"$f":"YEAR(Tabela2[[#This Row],[Data]])","v":2018},"2018-01-12","II",7500,5760,30,33.410925016730673,1.113697500557689,33.413063188737667,1.1137687729579222,2.5299999999999998,0.39525691699604742,24,2.3718750000000002,0.42160737812911725,25,{"$f":"IF(E20=\"\",\"\",I20*60*N20)","v":4554},{"$f":"IF(E20=\"\",\"\",(I20+I20/7.5*0.5)*3600)","v":115200},{"$f":"IF(E20=\"\",\"\",40/1.2)","v":33.333333333333336},{"$f":"IF(B20=\"\",\"\",ISEVEN(B20))","v":true},{"$f":"IF(B20=\"\",\"\",IF(W20=TRUE,IF(F20=\"I\",\"TAK\",\"NIE\"),IF(F20=\"I\",\"NIE\",IF(F20=\"III\",\"NIE\",\"TAK\"))))","v":"NIE"},{"$f":"IF(B20=\"\",\"\",IF(AND(X20=\"NIE\",Z20=\"NIE\"),\"TAK\",\"NIE\"))","v":"TAK"},{"$f":"IF(B20=\"\",\"\",IF(F20=\"III\",\"TAK\",\"NIE\"))","v":"NIE"},{"$f":"IF(E20=\"\",\"\",IF(X20=\"TAK\",\"Zmiana A\",IF(Y20=\"TAK\",\"Zmiana B\",\"Zmiana C\")))","v":"Zmiana B"}]
["piątek",2,"styczeń",{"$f":"YEAR(Tabela2[[#This Row],[Data]])","v":2018},"2018-01-12","II",7500,5760,22.5,16.971453751888532,0.7542868334172681,15.295163167801039,0.67978502968004617,0.89333333333333331,1.1194029850746268,67,0.83750000000000002,1.1940298507462686,72,{"$f":"IF(E21=\"\",\"\",I21*60*N21)","v":1206},{"$f":"IF(E21=\"\",\"\",(I21+I21/7.5*0.5)*3600)","v":86400},{"$f":"IF(E21=\"\",\"\",40/1.2)","v":33.333333333333336},{"$f":"IF(B21=\"\",\"\",ISEVEN(B21))","v":true},{"$f":"IF(B21=\"\",\"\",IF(W21=TRUE,IF(F21=\"I\",\"TAK\",\"NIE\"),IF(F21=\"I\",\"NIE\",IF(F21=\"III\",\"NIE\",\"TAK\"))))","v":"NIE"},{"$f":"IF(B21=\"\",\"\",IF(AND(X21=\"NIE\",Z21=\"NIE\"),\"TAK\",\"NIE\"))","v":"TAK"},{"$f":"IF(B21=\"\",\"\",IF(F21=\"III\",\"TAK\",\"NIE\"))","v":"NIE"},{"$f":"IF(E21=\"\",\"\",IF(X21=\"TAK\",\"Zmiana A\",IF(Y21=\"TAK\",\"Zmiana B\",\"Zmiana C\")))","v":"Zmiana B"}]
["piątek",2,"styczeń",{"$f":"YEAR(Tabela2[[#This Row],[Data]])","v":2018},"2018-01-12","III",2394,2369,7.5,9.4007936507936503,1.2534391534391534,9.8423964239655017,1.3123195231954001,5.264444444444444,0.18995356690586745,11,4.9354166666666668,0.20261713803292528,12,{"$f":"IF(E22=\"\",\"\",I22*60*N22)","v":2369},{"$f":"IF(E22=\"\",\"\",(I22+I22/7.5*0.5)*3600)","v":28800},{"$f":"IF(E22=\"\",\"\",40/1.2)","v":33.333333333333336},{"$f":"IF(B22=\"\",\"\",ISEVEN(B22))","v":true},{"$f":"IF(B22=\"\",\"\",IF(W22=TRUE,IF(F22=\"I\",\"TAK\",\"NIE\"),IF(F22=\"I\",\"NIE\",IF(F22=\"III\",\"NIE\",\"TAK\"))))","v":"NIE"},{"$f":"IF(B22=\"\",\"\",IF(AND(X22=\"NIE\",Z22=\"NIE\"),\"TAK\",\"NIE\"))","v":"NIE"},{"$f":"IF(B22=\"\",\"\",IF(F22=\"III\",\"TAK\",\"NIE\"))","v":"TAK"},{"$f":"IF(E22=\"\",\"\",IF(X22=\"TAK\",\"Zmiana A\",IF(Y22=\"TAK\",\"Zmiana B\",\"Zmiana C\")))","v":"Zmiana C"}]
["poniedziałek",3,"styczeń",{"$f":"YEAR(Tabela2[[#This Row],[Data]])","v":2018},"2018-01-15","I",2038,1591,45,46.845028725956084,1.0410006383545796,48.393222890975466,1.0754049531327881,2.0711111111111111,0.48283261802575106,29,1.9416666666666667,0.51502145922746778,31,{"$f":"IF(E23=\"\",\"\",I23*60*N23)","v":5592},{"$f":"IF(E23=\"\",\"\",(I23+I23/7.5*0.5)*3600)","v":172800},{"$f":"IF(E23=\"\",\"\",40/1.2)","v":33.333333333333336},{"$f":"IF(B23=\"\",\"\",ISEVEN(B23))","v":false},{"$f":"IF(B23=\"\",\"\",IF(W23=TRUE,IF(F23=\"I\",\"TAK\",\"NIE\"),IF(F23=\"I\",\"NIE\",IF(F23=\"III\",\"NIE\",\"TAK\"))))","v":"NIE"},{"$f":"IF(B23=\"\",\"\",IF(AND(X23=\"NIE\",Z23=\"NIE\"),\"TAK\",\"NIE\"))","v":"TAK"},{"$f":"IF(B23=\"\",\"\",IF(F23=\"III\",\"TAK\",\"NIE\"))","v":"NIE"},{"$f":"IF(E23=\"\",\"\",IF(X23=\"TAK\",\"Zmiana A\",IF(Y23=\"TAK\",\"Zmiana B\",\"Zmiana C\")))","v":"Zmiana B"}]
["poniedziałek",3,"styczeń",{"$f":"YEAR(Tabela2[[#This Row],[Data]])","v":2018},"2018-01-15","II",7597,5592,18.5,13.669950387694195,0.7389162371726592,12.640069280285241,0.68324698812352658,1.4333333333333333,0.69767441860465118,42,1.3258333333333334,0.75424261470773102,45,{"$f":"IF(E24=\"\",\"\",I24*60*N24)","v":1591},{"$f":"IF(E24=\"\",\"\",(I24+I24/7.5*0.5)*3600)","v":71040},{"$f":"IF(E24=\"\",\"\",40/1.2)","v":33.333333333333336},{"$f":"IF(B24=\"\",\"\",ISEVEN(B24))","v":false},{"$f":"IF(B24=\"\",\"\",IF(W24=TRUE,IF(F24=\"I\",\"TAK\",\"NIE\"),IF(F24=\"I\",\"NIE\",IF(F24=\"III\",\"NIE\",\"TAK\"))))","v":"TAK"},{"$f":"IF(B24=\"\",\"\",IF(AND(X24=\"NIE\",Z24=\"NIE\"),\"TAK\",\"NIE\"))","v":"NIE"},{"$f":"IF(B24=\"\",\"\",IF(F24=\"III\",\"TAK\",\"NIE\"))","v":"NIE"},{"$f":"IF(E24=\"\",\"\",IF(X24=\"TAK\",\"Zmiana A\",IF(Y24=\"TAK\",\"Zmiana B\",\"Zmiana C\")))","v":"Zmiana A"}]
[{"$f":"IF(E25=\"\",\"\",TEXT(WEEKDAY(IF(E25=0,\"\",E25),1),\"dddd\"))","v":"wtorek"},{"$f":"IF(E25=\"\",\"\",WEEKNUM(IF(E25=0,\"\",E25),1))","v":3},{"$f":"IF(E25=\"\",\"\",TEXT(IF(E25=0,\"\",MONTH(E25))*30,\"mmmm\"))","v":"styczeń"},{"$f":"YEAR(Tabela2[[#This Row],[Data]])","v":2018},"2018-01-16","III",2589,2377,7.5,9.4325396825396819,1.2576719576719575,7.888284949164154,1.0517713265552204,5.2822222222222219,0.18931426167437948,11,4.9520833333333334,0.20193521245267143,12,{"$f":"IF(E25=\"\",\"\",I25*60*N25)","v":2377},{"$f":"IF(E25=\"\",\"\",(I25+I25/7.5*0.5)*3600)","v":28800},{"$f":"IF(E25=\"\",\"\",40/1.2)","v":33.333333333333336},{"$f":"IF(B25=\"\",\"\",ISEVEN(B25))","v":false},{"$f":"IF(B25=\"\",\"\",IF(W25=TRUE,IF(F25=\"I\",\"TAK\",\"NIE\"),IF(F25=\"I\",\"NIE\",IF(F25=\"III\",\"NIE\",\"TAK\"))))","v":"NIE"},{"$f":"IF(B25=\"\",\"\",IF(AND(X25=\"NIE\",Z25=\"NIE\"),\"TAK\",\"NIE\"))","v":"NIE"},{"$f":"IF(B25=\"\",\"\",IF(F25=\"III\",\"TAK\",\"NIE\"))","v":"TAK"},{"$f":"IF(E25=\"\",\"\",IF(X25=\"TAK\",\"Zmiana A\",IF(Y25=\"TAK\",\"Zmiana B\",\"Zmiana C\")))","v":"Zmiana C"}]
[{"$f":"IF(E26=\"\",\"\",TEXT(WEEKDAY(IF(E26=0,\"\",E26),1),\"dddd\"))","v":"środa"},{"$f":"IF(E26=\"\",\"\",WEEKNUM(IF(E26=0,\"\",E26),1))","v":3},{"$f":"IF(E26=\"\",\"\",TEXT(IF(E26=0,\"\",MONTH(E26))*30,\"mmmm\"))","v":"styczeń"},{"$f":"YEAR(Tabela2[[#This Row],[Data]])","v":2018},"2018-01-17","III",2690,2367,7.5,9.3928571428571423,1.2523809523809524,9.2175098975368712,1.2290013196715828,5.26,0.19011406844106463,11,4.9312500000000004,0.20278833967046894,12,{"$f":"IF(E26=\"\",\"\",I26*60*N26)","v":2367},{"$f":"IF(E26=\"\",\"\",(I26+I26/7.5*0.5)*3600)","v":28800},{"$f":"IF(E26=\"\",\"\",40/1.2)","v":33.333333333333336},{"$f":"IF(B26=\"\",\"\",ISEVEN(B26))","v":false},{"$f":"IF(B26=\"\",\"\",IF(W26=TRUE,IF(F26=\"I\",\"TAK\",\"NIE\"),IF(F26=\"I\",\"NIE\",IF(F26=\"III\",\"NIE\",\"TAK\"))))","v":"NIE"},{"$f":"IF(B26=\"\",\"\",IF(AND(X26=\"NIE\",Z26=\"NIE\"),\"TAK\",\"NIE\"))","v":"NIE"},{"$f":"IF(B26=\"\",\"\",IF(F26=\"III\",\"TAK\",\"NIE\"))","v":"TAK"},{"$f":"IF(E26=\"\",\"\",IF(X26=\"TAK\",\"Zmiana A\",IF(Y26=\"TAK\",\"Zmiana B\",\"Zmiana C\")))","v":"Zmiana C"}]
["czwartek",3,"styczeń",{"$f":"YEAR(Tabela2[[#This Row],[Data]])","v":2018},"2018-01-18","I",2625,2047,45,49.372719277009615,1.0971715394891026,48.612775127992897,1.0802838917331754,2.0622222222222222,0.48491379310344829,29,1.9333333333333333,0.51724137931034486,31,{"$f":"IF(E27=\"\",\"\",I27*60*N27)","v":5568},{"$f":"IF(E27=\"\",\"\",(I27+I27/7.5*0.5)*3600)","v":172800},{"$f":"IF(E27=\"\",\"\",40/1.2)","v":33.333333333333336},{"$f":"IF(B27=\"\",\"\",ISEVEN(B27))","v":false},{"$f":"IF(B27=\"\",\"\",IF(W27=TRUE,IF(F27=\"I\",\"TAK\",\"NIE\"),IF(F27=\"I\",\"NIE\",IF(F27=\"III\",\"NIE\",\"TAK\"))))","v":"NIE"},{"$f":"IF(B27=\"\",\"\",IF(AND(X27=\"NIE\",Z27=\"NIE\"),\"TAK\",\"NIE\"))","v":"TAK"},{"$f":"IF(B27=\"\",\"\",IF(F27=\"III\",\"TAK\",\"NIE\"))","v":"NIE"},{"$f":"IF(E27=\"\",\"\",IF(X27=\"TAK\",\"Zmiana A\",IF(Y27=\"TAK\",\"Zmiana B\",\"Zmiana C\")))","v":"Zmiana B"}]
["czwartek",3,"styczeń",{"$f":"YEAR(Tabela2[[#This Row],[Data]])","v":2018},"2018-01-18","II",7034,5568,22.5,22.796810458011414,1.0131915759116183,22.904997914475572,1.0179999073100254,1.5162962962962963,0.65950170981924772,40,1.4215277777777777,0.70346849047386417,42,{"$f":"IF(E28=\"\",\"\",I28*60*N28)","v":2047},{"$f":"IF(E28=\"\",\"\",(I28+I28/7.5*0.5)*3600)","v":86400},{"$f":"IF(E28=\"\",\"\",40/1.2)","v":33.333333333333336},{"$f":"IF(B28=\"\",\"\",ISEVEN(B28))","v":false},{"$f":"IF(B28=\"\",\"\",IF(W28=TRUE,IF(F28=\"I\",\"TAK\",\"NIE\"),IF(F28=\"I\",\"NIE\",IF(F28=\"III\",\"NIE\",\"TAK\"))))","v":"TAK"},{"$f":"IF(B28=\"\",\"\",IF(AND(X28=\"NIE\",Z28=\"NIE\"),\"TAK\",\"NIE\"))","v":"NIE"},{"$f":"IF(B28=\"\",\"\",IF(F28=\"III\",\"TAK\",\"NIE\"))","v":"NIE"},{"$f":"IF(E28=\"\",\"\",IF(X28=\"TAK\",\"Zmiana A\",IF(Y28=\"TAK\",\"Zmiana B\",\"Zmiana C\")))","v":"Zmiana A"}]
["czwartek",3,"styczeń",{"$f":"YEAR(Tabela2[[#This Row],[Data]])","v":2018},"2018-01-18","III",2267,2355,7.5,9.3452380952380949,1.246031746031746,8.6587988860587473,1.1545065181411662,5.2333333333333334,0.19108280254777071,11,4.90625,0.20382165605095542,12,{"$f":"IF(E29=\"\",\"\",I29*60*N29)","v":2355},{"$f":"IF(E29=\"\",\"\",(I29+I29/7.5*0.5)*3600)","v":28800},{"$f":"IF(E29=\"\",\"\",40/1.2)","v":33.333333333333336},{"$f":"IF(B29=\"\",\"\",ISEVEN(B29))","v":false},{"$f":"IF(B29=\"\",\"\",IF(W29=TRUE,IF(F29=\"I\",\"TAK\",\"NIE\"),IF(F29=\"I\",\"NIE\",IF(F29=\"III\",\"NIE\",\"TAK\"))))","v":"NIE"},{"$f":"IF(B29=\"\",\"\",IF(AND(X29=\"NIE\",Z29=\"NIE\"),\"TAK\",\"NIE\"))","v":"NIE"},{"$f":"IF(B29=\"\",\"\",IF(F29=\"III\",\"TAK\",\"NIE\"))","v":"TAK"},{"$f":"IF(E29=\"\",\"\",IF(X29=\"TAK\",\"Zmiana A\",IF(Y29=\"TAK\",\"Zmiana B\",\"Zmiana C\")))","v":"Zmiana C"}]
["piątek",3,"styczeń",{"$f":"YEAR(Tabela2[[#This Row],[Data]])","v":2018},"2018-01-19","I",1225,772,30,23.71521486643438,0.79050716221447936,23.549466330691875,0.78498221102306254,2.0105555555555554,0.49737496546007182,30,1.8848958333333334,0.53053329649074332,32,{"$f":"IF(E30=\"\",\"\",I30*60*N30)","v":3619},{"$f":"IF(E30=\"\",\"\",(I30+I30/7.5*0.5)*3600)","v":115200},{"$f":"IF(E30=\"\",\"\",40/1.2)","v":33.333333333333336},{"$f":"IF(B30=\"\",\"\",ISEVEN(B30))","v":false},{"$f":"IF(B30=\"\",\"\",IF(W30=TRUE,IF(F30=\"I\",\"TAK\",\"NIE\"),IF(F30=\"I\",\"NIE\",IF(F30=\"III\",\"NIE\",\"TAK\"))))","v":"NIE"},{"$f":"IF(B30=\"\",\"\",IF(AND(X30=\"NIE\",Z30=\"NIE\"),\"TAK\",\"NIE\"))","v":"TAK"},{"$f":"IF(B30=\"\",\"\",IF(F30=\"III\",\"TAK\",\"NIE\"))","v":"NIE"},{"$f":"IF(E30=\"\",\"\",IF(X30=\"TAK\",\"Zmiana A\",IF(Y30=\"TAK\",\"Zmiana B\",\"Zmiana C\")))","v":"Zmiana B"}]
["piątek",3,"styczeń",{"$f":"YEAR(Tabela2[[#This Row],[Data]])","v":2018},"2018-01-19","II",9979,7238,15,11.101081591173054,0.74007210607820362,9.9448523635249035,0.66299015756832691,0.85777777777777775,1.1658031088082901,70,0.8041666666666667,1.2435233160621761,75,{"$f":"IF(E31=\"\",\"\",I31*60*N31)","v":772},{"$f":"IF(E31=\"\",\"\",(I31+I31/7.5*0.5)*3600)","v":57600},{"$f":"IF(E31=\"\",\"\",40/1.2)","v":33.333333333333336},{"$f":"IF(B31=\"\",\"\",ISEVEN(B31))","v":false},{"$f":"IF(B31=\"\",\"\",IF(W31=TRUE,IF(F31=\"I\",\"TAK\",\"NIE\"),IF(F31=\"I\",\"NIE\",IF(F31=\"III\",\"NIE\",\"TAK\"))))","v":"TAK"},{"$f":"IF(B31=\"\",\"\",IF(AND(X31=\"NIE\",Z31=\"NIE\"),\"TAK\",\"NIE\"))","v":"NIE"},{"$f":"IF(B31=\"\",\"\",IF(F31=\"III\",\"TAK\",\"NIE\"))","v":"NIE"},{"$f":"IF(E31=\"\",\"\",IF(X31=\"TAK\",\"Zmiana A\",IF(Y31=\"TAK\",\"Zmiana B\",\"Zmiana C\")))","v":"Zmiana A"}]
[{"$f":"IF(E32=\"\",\"\",TEXT(WEEKDAY(IF(E32=0,\"\",E32),1),\"dddd\"))","v":"piątek"},{"$f":"IF(E32=\"\",\"\",WEEKNUM(IF(E32=0,\"\",E32),1))","v":3},{"$f":"IF(E32=\"\",\"\",TEXT(IF(E32=0,\"\",MONTH(E32))*30,\"mmmm\"))","v":"styczeń"},{"$f":"YEAR(Tabela2[[#This Row],[Data]])","v":2018},"2018-01-19","I",1225,772,30,23.71521486643438,0.79050716221447936,22.193606453364726,0.73978688177882423,2.0105555555555554,0.49737496546007182,30,1.8848958333333334,0.53053329649074332,32,{"$f":"IF(E32=\"\",\"\",I32*60*N32)","v":3619},{"$f":"IF(E32=\"\",\"\",(I32+I32/7.5*0.5)*3600)","v":115200},{"$f":"IF(E32=\"\",\"\",40/1.2)","v":33.333333333333336},{"$f":"IF(B32=\"\",\"\",ISEVEN(B32))","v":false},{"$f":"IF(B32=\"\",\"\",IF(W32=TRUE,IF(F32=\"I\",\"TAK\",\"NIE\"),IF(F32=\"I\",\"NIE\",IF(F32=\"III\",\"NIE\",\"TAK\"))))","v":"NIE"},{"$f":"IF(B32=\"\",\"\",IF(AND(X32=\"NIE\",Z32=\"NIE\"),\"TAK\",\"NIE\"))","v":"TAK"},{"$f":"IF(B32=\"\",\"\",IF(F32=\"III\",\"TAK\",\"NIE\"))","v":"NIE"},{"$f":"IF(E32=\"\",\"\",IF(X32=\"TAK\",\"Zmiana A\",IF(Y32=\"TAK\",\"Zmiana B\",\"Zmiana C\")))","v":"Zmiana B"}]
[{"$f":"IF(E33=\"\",\"\",TEXT(WEEKDAY(IF(E33=0,\"\",E33),1),\"dddd\"))","v":"piątek"},{"$f":"IF(E33=\"\",\"\",WEEKNUM(IF(E33=0,\"\",E33),1))","v":3},{"$f":"IF(E33=\"\",\"\",TEXT(IF(E33=0,\"\",MONTH(E33))*30,\"mmmm\"))","v":"styczeń"},{"$f":"YEAR(Tabela2[[#This Row],[Data]])","v":2018},"2018-01-19","III",2462,2381,7.5,9.4484126984126977,1.2597883597883597,9.4482289931207788,1.2597638657494372,5.2911111111111113,0.18899622007559849,11,4.9604166666666663,0.2015959680806384,12,{"$f":"IF(E33=\"\",\"\",I33*60*N33)","v":2381},{"$f":"IF(E33=\"\",\"\",(I33+I33/7.5*0.5)*3600)","v":28800},{"$f":"IF(E33=\"\",\"\",40/1.2)","v":33.333333333333336},{"$f":"IF(B33=\"\",\"\",ISEVEN(B33))","v":false},{"$f":"IF(B33=\"\",\"\",IF(W33=TRUE,IF(F33=\"I\",\"TAK\",\"NIE\"),IF(F33=\"I\",\"NIE\",IF(F33=\"III\",\"NIE\",\"TAK\"))))","v":"NIE"},{"$f":"IF(B33=\"\",\"\",IF(AND(X33=\"NIE\",Z33=\"NIE\"),\"TAK\",\"NIE\"))","v":"NIE"},{"$f":"IF(B33=\"\",\"\",IF(F33=\"III\",\"TAK\",\"NIE\"))","v":"TAK"},{"$f":"IF(E33=\"\",\"\",IF(X33=\"TAK\",\"Zmiana A\",IF(Y33=\"TAK\",\"Zmiana B\",\"Zmiana C\")))","v":"Zmiana C"}]
[{"$f":"IF(E34=\"\",\"\",TEXT(WEEKDAY(IF(E34=0,\"\",E34),1),\"dddd\"))","v":"poniedziałek"},{"$f":"IF(E34=\"\",\"\",WEEKNUM(IF(E34=0,\"\",E34),1))","v":4},{"$f":"IF(E34=\"\",\"\",TEXT(IF(E34=0,\"\",MONTH(E34))*30,\"mmmm\"))","v":"styczeń"},{"$f":"YEAR(Tabela2[[#This Row],[Data]])","v":2018},"2018-01-22","I",7749,5522,30,42.098477915303178,1.4032825971767726,41.279540829892071,1.3759846943297356,3.0677777777777777,0.3259688518652662,20,2.8760416666666666,0.34770010865628398,21,{"$f":"IF(E34=\"\",\"\",I34*60*N34)","v":5522},{"$f":"IF(E34=\"\",\"\",(I34+I34/7.5*0.5)*3600)","v":115200},{"$f":"IF(E34=\"\",\"\",40/1.2)","v":33.333333333333336},{"$f":"IF(B34=\"\",\"\",ISEVEN(B34))","v":true},{"$f":"IF(B34=\"\",\"\",IF(W34=TRUE,IF(F34=\"I\",\"TAK\",\"NIE\"),IF(F34=\"I\",\"NIE\",IF(F34=\"III\",\"NIE\",\"TAK\"))))","v":"TAK"},{"$f":"IF(B34=\"\",\"\",IF(AND(X34=\"NIE\",Z34=\"NIE\"),\"TAK\",\"NIE\"))","v":"NIE"},{"$f":"IF(B34=\"\",\"\",IF(F34=\"III\",\"TAK\",\"NIE\"))","v":"NIE"},{"$f":"IF(E34=\"\",\"\",IF(X34=\"TAK\",\"Zmiana A\",IF(Y34=\"TAK\",\"Zmiana B\",\"Zmiana C\")))","v":"Zmiana A"}]
[{"$f":"IF(E35=\"\",\"\",TEXT(WEEKDAY(IF(E35=0,\"\",E35),1),\"dddd\"))","v":"poniedziałek"},{"$f":"IF(E35=\"\",\"\",WEEKNUM(IF(E35=0,\"\",E35),1))","v":4},{"$f":"IF(E35=\"\",\"\",TEXT(IF(E35=0,\"\",MONTH(E35))*30,\"mmmm\"))","v":"styczeń"},{"$f":"YEAR(Tabela2[[#This Row],[Data]])","v":2018},"2018-01-22","II",2646,1777,22.5,27.959935897435898,1.2426638176638176,29.898822418564809,1.3288365519362138,1.3162962962962963,0.75970737197523919,46,1.2340277777777777,0.81035453010692182,49,{"$f":"IF(E35=\"\",\"\",I35*60*N35)","v":1777},{"$f":"IF(E35=\"\",\"\",(I35+I35/7.5*0.5)*3600)","v":86400},{"$f":"IF(E35=\"\",\"\",40/1.2)","v":33.333333333333336},{"$f":"IF(B35=\"\",\"\",ISEVEN(B35))","v":true},{"$f":"IF(B35=\"\",\"\",IF(W35=TRUE,IF(F35=\"I\",\"TAK\",\"NIE\"),IF(F35=\"I\",\"NIE\",IF(F35=\"III\",\"NIE\",\"TAK\"))))","v":"NIE"},{"$f":"IF(B35=\"\",\"\",IF(AND(X35=\"NIE\",Z35=\"NIE\"),\"TAK\",\"NIE\"))","v":"TAK"},{"$f":"IF(B35=\"\",\"\",IF(F35=\"III\",\"TAK\",\"NIE\"))","v":"NIE"},{"$f":"IF(E35=\"\",\"\",IF(X35=\"TAK\",\"Zmiana A\",IF(Y35=\"TAK\",\"Zmiana B\",\"Zmiana C\")))","v":"Zmiana B"}]
[{"$f":"IF(E36=\"\",\"\",TEXT(WEEKDAY(IF(E36=0,\"\",E36),1),\"dddd\"))","v":"poniedziałek"},{"$f":"IF(E36=\"\",\"\",WEEKNUM(IF(E36=0,\"\",E36),1))","v":4},{"$f":"IF(E36=\"\",\"\",TEXT(IF(E36=0,\"\",MONTH(E36))*30,\"mmmm\"))","v":"styczeń"},{"$f":"YEAR(Tabela2[[#This Row],[Data]])","v":2018},"2018-01-22","III",3877,2918,22.5,16.191452991452991,0.71962013295346627,16.508717379213774,0.73372077240950107,2.1614814814814816,0.46264564770390676,28,2.026388888888889,0.49348869088416725,30,{"$f":"IF(E36=\"\",\"\",I36*60*N36)","v":2918},{"$f":"IF(E36=\"\",\"\",(I36+I36/7.5*0.5)*3600)","v":86400},{"$f":"IF(E36=\"\",\"\",40/1.2)","v":33.333333333333336},{"$f":"IF(B36=\"\",\"\",ISEVEN(B36))","v":true},{"$f":"IF(B36=\"\",\"\",IF(W36=TRUE,IF(F36=\"I\",\"TAK\",\"NIE\"),IF(F36=\"I\",\"NIE\",IF(F36=\"III\",\"NIE\",\"TAK\"))))","v":"NIE"},{"$f":"IF(B36=\"\",\"\",IF(AND(X36=\"NIE\",Z36=\"NIE\"),\"TAK\",\"NIE\"))","v":"NIE"},{"$f":"IF(B36=\"\",\"\",IF(F36=\"III\",\"TAK\",\"NIE\"))","v":"TAK"},{"$f":"IF(E36=\"\",\"\",IF(X36=\"TAK\",\"Zmiana A\",IF(Y36=\"TAK\",\"Zmiana B\",\"Zmiana C\")))","v":"Zmiana C"}]
[{"$f":"IF(E37=\"\",\"\",TEXT(WEEKDAY(IF(E37=0,\"\",E37),1),\"dddd\"))","v":"wtorek"},{"$f":"IF(E37=\"\",\"\",WEEKNUM(IF(E37=0,\"\",E37),1))","v":4},{"$f":"IF(E37=\"\",\"\",TEXT(IF(E37=0,\"\",MONTH(E37))*30,\"mmmm\"))","v":"styczeń"},{"$f":"YEAR(Tabela2[[#This Row],[Data]])","v":2018},"2018-01-23","I",8147,7269,15,12.307692307692308,0.8205128205128206,12.227467045776105,0.81516446971840706,1.7777777777777777,0.5625,34,1.6666666666666667,0.6,36,{"$f":"IF(E37=\"\",\"\",I37*60*N37)","v":1600},{"$f":"IF(E37=\"\",\"\",(I37+I37/7.5*0.5)*3600)","v":57600},{"$f":"IF(E37=\"\",\"\",40/1.2)","v":33.333333333333336},{"$f":"IF(B37=\"\",\"\",ISEVEN(B37))","v":true},{"$f":"IF(B37=\"\",\"\",IF(W37=TRUE,IF(F37=\"I\",\"TAK\",\"NIE\"),IF(F37=\"I\",\"NIE\",IF(F37=\"III\",\"NIE\",\"TAK\"))))","v":"TAK"},{"$f":"IF(B37=\"\",\"\",IF(AND(X37=\"NIE\",Z37=\"NIE\"),\"TAK\",\"NIE\"))","v":"NIE"},{"$f":"IF(B37=\"\",\"\",IF(F37=\"III\",\"TAK\",\"NIE\"))","v":"NIE"},{"$f":"IF(E37=\"\",\"\",IF(X37=\"TAK\",\"Zmiana A\",IF(Y37=\"TAK\",\"Zmiana B\",\"Zmiana C\")))","v":"Zmiana A"}]
["wtorek",4,"styczeń",{"$f":"YEAR(Tabela2[[#This Row],[Data]])","v":2018},"2018-01-23","I",8147,7269,15,0.625,4.1666666666666664E-2,0.75573365883424115,5.0382243922282743E-2,1.1111111111111112,0.9,54,1.0416666666666667,0.96,58,{"$f":"IF(E38=\"\",\"\",I38*60*N38)","v":1000},{"$f":"IF(E38=\"\",\"\",(I38+I38/7.5*0.5)*3600)","v":57600},{"$f":"IF(E38=\"\",\"\",40/1.2)","v":33.333333333333336},{"$f":"IF(B38=\"\",\"\",ISEVEN(B38))","v":true},{"$f":"IF(B38=\"\",\"\",IF(W38=TRUE,IF(F38=\"I\",\"TAK\",\"NIE\"),IF(F38=\"I\",\"NIE\",IF(F38=\"III\",\"NIE\",\"TAK\"))))","v":"TAK"},{"$f":"IF(B38=\"\",\"\",IF(AND(X38=\"NIE\",Z38=\"NIE\"),\"TAK\",\"NIE\"))","v":"NIE"},{"$f":"IF(B38=\"\",\"\",IF(F38=\"III\",\"TAK\",\"NIE\"))","v":"NIE"},{"$f":"IF(E38=\"\",\"\",IF(X38=\"TAK\",\"Zmiana A\",IF(Y38=\"TAK\",\"Zmiana B\",\"Zmiana C\")))","v":"Zmiana A"}]
["wtorek",4,"styczeń",{"$f":"YEAR(Tabela2[[#This Row],[Data]])","v":2018},"2018-01-23","I",8147,7269,30,25.924579269458789,0.86415264231529298,25.992017758872773,0.8664005919624258,2.5938888888888889,0.3855215249518098,23,2.4317708333333332,0.41122295994859714,25,{"$f":"IF(E39=\"\",\"\",I39*60*N39)","v":4669},{"$f":"IF(E39=\"\",\"\",(I39+I39/7.5*0.5)*3600)","v":115200},{"$f":"IF(E39=\"\",\"\",40/1.2)","v":33.333333333333336},{"$f":"IF(B39=\"\",\"\",ISEVEN(B39))","v":true},{"$f":"IF(B39=\"\",\"\",IF(W39=TRUE,IF(F39=\"I\",\"TAK\",\"NIE\"),IF(F39=\"I\",\"NIE\",IF(F39=\"III\",\"NIE\",\"TAK\"))))","v":"TAK"},{"$f":"IF(B39=\"\",\"\",IF(AND(X39=\"NIE\",Z39=\"NIE\"),\"TAK\",\"NIE\"))","v":"NIE"},{"$f":"IF(B39=\"\",\"\",IF(F39=\"III\",\"TAK\",\"NIE\"))","v":"NIE"},{"$f":"IF(E39=\"\",\"\",IF(X39=\"TAK\",\"Zmiana A\",IF(Y39=\"TAK\",\"Zmiana B\",\"Zmiana C\")))","v":"Zmiana A"}]
["wtorek",4,"styczeń",{"$f":"YEAR(Tabela2[[#This Row],[Data]])","v":2018},"2018-01-23","II",1693,1406,21.5,23.202540106951876,1.07918791195125,24.371605621446029,1.1335630521602804,1.0899224806201551,0.91749644381223328,55,1.018840579710145,0.98150782361308675,59,{"$f":"IF(E40=\"\",\"\",I40*60*N40)","v":1406},{"$f":"IF(E40=\"\",\"\",(I40+I40/7.5*0.5)*3600)","v":82560},{"$f":"IF(E40=\"\",\"\",40/1.2)","v":33.333333333333336},{"$f":"IF(B40=\"\",\"\",ISEVEN(B40))","v":true},{"$f":"IF(B40=\"\",\"\",IF(W40=TRUE,IF(F40=\"I\",\"TAK\",\"NIE\"),IF(F40=\"I\",\"NIE\",IF(F40=\"III\",\"NIE\",\"TAK\"))))","v":"NIE"},{"$f":"IF(B40=\"\",\"\",IF(AND(X40=\"NIE\",Z40=\"NIE\"),\"TAK\",\"NIE\"))","v":"TAK"},{"$f":"IF(B40=\"\",\"\",IF(F40=\"III\",\"TAK\",\"NIE\"))","v":"NIE"},{"$f":"IF(E40=\"\",\"\",IF(X40=\"TAK\",\"Zmiana A\",IF(Y40=\"TAK\",\"Zmiana B\",\"Zmiana C\")))","v":"Zmiana B"}]
["wtorek",4,"styczeń",{"$f":"YEAR(Tabela2[[#This Row],[Data]])","v":2018},"2018-01-23","III",3910,3615,22.5,27.465945165945161,1.2207086740420072,28.970429929651214,1.287574663540054,2.6777777777777776,0.37344398340248963,22,2.5104166666666665,0.39834024896265557,24,{"$f":"IF(E41=\"\",\"\",I41*60*N41)","v":3614.9999999999995},{"$f":"IF(E41=\"\",\"\",(I41+I41/7.5*0.5)*3600)","v":86400},{"$f":"IF(E41=\"\",\"\",40/1.2)","v":33.333333333333336},{"$f":"IF(B41=\"\",\"\",ISEVEN(B41))","v":true},{"$f":"IF(B41=\"\",\"\",IF(W41=TRUE,IF(F41=\"I\",\"TAK\",\"NIE\"),IF(F41=\"I\",\"NIE\",IF(F41=\"III\",\"NIE\",\"TAK\"))))","v":"NIE"},{"$f":"IF(B41=\"\",\"\",IF(AND(X41=\"NIE\",Z41=\"NIE\"),\"TAK\",\"NIE\"))","v":"NIE"},{"$f":"IF(B41=\"\",\"\",IF(F41=\"III\",\"TAK\",\"NIE\"))","v":"TAK"},{"$f":"IF(E41=\"\",\"\",IF(X41=\"TAK\",\"Zmiana A\",IF(Y41=\"TAK\",\"Zmiana B\",\"Zmiana C\")))","v":"Zmiana C"}]
["środa",4,"styczeń",{"$f":"YEAR(Tabela2[[#This Row],[Data]])","v":2018},"2018-01-24","I",6125,4944,30,37.715521577771945,1.2571840525923981,36.737338463330353,1.2245779487776784,2.7466666666666666,0.36407766990291263,22,2.5750000000000002,0.38834951456310679,23,{"$f":"IF(E42=\"\",\"\",I42*60*N42)","v":4944},{"$f":"IF(E42=\"\",\"\",(I42+I42/7.5*0.5)*3600)","v":115200},{"$f":"IF(E42=\"\",\"\",40/1.2)","v":33.333333333333336},{"$f":"IF(B42=\"\",\"\",ISEVEN(B42))","v":true},{"$f":"IF(B42=\"\",\"\",IF(W42=TRUE,IF(F42=\"I\",\"TAK\",\"NIE\"),IF(F42=\"I\",\"NIE\",IF(F42=\"III\",\"NIE\",\"TAK\"))))","v":"TAK"},{"$f":"IF(B42=\"\",\"\",IF(AND(X42=\"NIE\",Z42=\"NIE\"),\"TAK\",\"NIE\"))","v":"NIE"},{"$f":"IF(B42=\"\",\"\",IF(F42=\"III\",\"TAK\",\"NIE\"))","v":"NIE"},{"$f":"IF(E42=\"\",\"\",IF(X42=\"TAK\",\"Zmiana A\",IF(Y42=\"TAK\",\"Zmiana B\",\"Zmiana C\")))","v":"Zmiana A"}]
[{"$f":"IF(E43=\"\",\"\",TEXT(WEEKDAY(IF(E43=0,\"\",E43),1),\"dddd\"))","v":"środa"},{"$f":"IF(E43=\"\",\"\",WEEKNUM(IF(E43=0,\"\",E43),1))","v":4},{"$f":"IF(E43=\"\",\"\",TEXT(IF(E43=0,\"\",MONTH(E43))*30,\"mmmm\"))","v":"styczeń"},{"$f":"YEAR(Tabela2[[#This Row],[Data]])","v":2018},"2018-01-24","II",3992,2521,22.5,15.293463551916865,0.67970949119630508,16.890222043835934,0.75067653528159706,1.8674074074074074,0.53550178500595003,32,1.7506944444444446,0.57120190400634674,34,{"$f":"IF(E43=\"\",\"\",I43*60*N43)","v":2521},{"$f":"IF(E43=\"\",\"\",(I43+I43/7.5*0.5)*3600)","v":86400},{"$f":"IF(E43=\"\",\"\",40/1.2)","v":33.333333333333336},{"$f":"IF(B43=\"\",\"\",ISEVEN(B43))","v":true},{"$f":"IF(B43=\"\",\"\",IF(W43=TRUE,IF(F43=\"I\",\"TAK\",\"NIE\"),IF(F43=\"I\",\"NIE\",IF(F43=\"III\",\"NIE\",\"TAK\"))))","v":"NIE"},{"$f":"IF(B43=\"\",\"\",IF(AND(X43=\"NIE\",Z43=\"NIE\"),\"TAK\",\"NIE\"))","v":"TAK"},{"$f":"IF(B43=\"\",\"\",IF(F43=\"III\",\"TAK\",\"NIE\"))","v":"NIE"},{"$f":"IF(E43=\"\",\"\",IF(X43=\"TAK\",\"Zmiana A\",IF(Y43=\"TAK\",\"Zmiana B\",\"Zmiana C\")))","v":"Zmiana B"}]
["czwartek",4,"styczeń",{"$f":"YEAR(Tabela2[[#This Row],[Data]])","v":2018},"2018-01-25","I",5917,4289,30,42.571405022495057,1.4190468340831686,44.433281413726753,1.4811093804575584,2.3827777777777777,0.41967824667754722,25,2.2338541666666667,0.44765679645605039,27,{"$f":"IF(E44=\"\",\"\",I44*60*N44)","v":4289},{"$f":"IF(E44=\"\",\"\",(I44+I44/7.5*0.5)*3600)","v":115200},{"$f":"IF(E44=\"\",\"\",40/1.2)","v":33.333333333333336},{"$f":"IF(B44=\"\",\"\",ISEVEN(B44))","v":true},{"$f":"IF(B44=\"\",\"\",IF(W44=TRUE,IF(F44=\"I\",\"TAK\",\"NIE\"),IF(F44=\"I\",\"NIE\",IF(F44=\"III\",\"NIE\",\"TAK\"))))","v":"TAK"},{"$f":"IF(B44=\"\",\"\",IF(AND(X44=\"NIE\",Z44=\"NIE\"),\"TAK\",\"NIE\"))","v":"NIE"},{"$f":"IF(B44=\"\",\"\",IF(F44=\"III\",\"TAK\",\"NIE\"))","v":"NIE"},{"$f":"IF(E44=\"\",\"\",IF(X44=\"TAK\",\"Zmiana A\",IF(Y44=\"TAK\",\"Zmiana B\",\"Zmiana C\")))","v":"Zmiana A"}]
["czwartek",4,"styczeń",{"$f":"YEAR(Tabela2[[#This Row],[Data]])","v":2018},"2018-01-25","II",2811,2147,30,41.254853279030918,1.3751617759676973,41.125197700637905,1.3708399233545969,1.1927777777777777,0.83837913367489525,50,1.1182291666666666,0.89427107591988819,54,{"$f":"IF(E45=\"\",\"\",I45*60*N45)","v":2147},{"$f":"IF(E45=\"\",\"\",(I45+I45/7.5*0.5)*3600)","v":115200},{"$f":"IF(E45=\"\",\"\",40/1.2)","v":33.333333333333336},{"$f":"IF(B45=\"\",\"\",ISEVEN(B45))","v":true},{"$f":"IF(B45=\"\",\"\",IF(W45=TRUE,IF(F45=\"I\",\"TAK\",\"NIE\"),IF(F45=\"I\",\"NIE\",IF(F45=\"III\",\"NIE\",\"TAK\"))))","v":"NIE"},{"$f":"IF(B45=\"\",\"\",IF(AND(X45=\"NIE\",Z45=\"NIE\"),\"TAK\",\"NIE\"))","v":"TAK"},{"$f":"IF(B45=\"\",\"\",IF(F45=\"III\",\"TAK\",\"NIE\"))","v":"NIE"},{"$f":"IF(E45=\"\",\"\",IF(X45=\"TAK\",\"Zmiana A\",IF(Y45=\"TAK\",\"Zmiana B\",\"Zmiana C\")))","v":"Zmiana B"}]
["piątek",4,"styczeń",{"$f":"YEAR(Tabela2[[#This Row],[Data]])","v":2018},"2018-01-26","III",5316,4733,7.5,9.412698412698413,1.2550264550264552,8.2831336887498583,1.1044178251666479,5.2711111111111109,0.1897133220910624,11,4.9416666666666664,0.20236087689713322,12,{"$f":"IF(E46=\"\",\"\",I46*60*N46)","v":2372},{"$f":"IF(E46=\"\",\"\",(I46+I46/7.5*0.5)*3600)","v":28800},{"$f":"IF(E46=\"\",\"\",40/1.2)","v":33.333333333333336},{"$f":"IF(B46=\"\",\"\",ISEVEN(B46))","v":true},{"$f":"IF(B46=\"\",\"\",IF(W46=TRUE,IF(F46=\"I\",\"TAK\",\"NIE\"),IF(F46=\"I\",\"NIE\",IF(F46=\"III\",\"NIE\",\"TAK\"))))","v":"NIE"},{"$f":"IF(B46=\"\",\"\",IF(AND(X46=\"NIE\",Z46=\"NIE\"),\"TAK\",\"NIE\"))","v":"NIE"},{"$f":"IF(B46=\"\",\"\",IF(F46=\"III\",\"TAK\",\"NIE\"))","v":"TAK"},{"$f":"IF(E46=\"\",\"\",IF(X46=\"TAK\",\"Zmiana A\",IF(Y46=\"TAK\",\"Zmiana B\",\"Zmiana C\")))","v":"Zmiana C"}]
["piątek",4,"styczeń",{"$f":"YEAR(Tabela2[[#This Row],[Data]])","v":2018},"2018-01-26","III",5316,4733,7.5,9.3690476190476186,1.2492063492063492,7.5141800087192774,1.001890667829237,5.246666666666667,0.19059720457433291,11,4.9187500000000002,0.20330368487928843,12,{"$f":"IF(E47=\"\",\"\",I47*60*N47)","v":2361},{"$f":"IF(E47=\"\",\"\",(I47+I47/7.5*0.5)*3600)","v":28800},{"$f":"IF(E47=\"\",\"\",40/1.2)","v":33.333333333333336},{"$f":"IF(B47=\"\",\"\",ISEVEN(B47))","v":true},{"$f":"IF(B47=\"\",\"\",IF(W47=TRUE,IF(F47=\"I\",\"TAK\",\"NIE\"),IF(F47=\"I\",\"NIE\",IF(F47=\"III\",\"NIE\",\"TAK\"))))","v":"NIE"},{"$f":"IF(B47=\"\",\"\",IF(AND(X47=\"NIE\",Z47=\"NIE\"),\"TAK\",\"NIE\"))","v":"NIE"},{"$f":"IF(B47=\"\",\"\",IF(F47=\"III\",\"TAK\",\"NIE\"))","v":"TAK"},{"$f":"IF(E47=\"\",\"\",IF(X47=\"TAK\",\"Zmiana A\",IF(Y47=\"TAK\",\"Zmiana B\",\"Zmiana C\")))","v":"Zmiana C"}]
["piątek",4,"styczeń",{"$f":"YEAR(Tabela2[[#This Row],[Data]])","v":2018},"2018-01-26","II",963,859,15,12.805333333333333,0.85368888888888894,14.767637847118044,0.98450918980786961,0.95444444444444443,1.0477299185098952,63,0.89479166666666665,1.1175785797438882,67,{"$f":"IF(E48=\"\",\"\",I48*60*N48)","v":859},{"$f":"IF(E48=\"\",\"\",(I48+I48/7.5*0.5)*3600)","v":57600},{"$f":"IF(E48=\"\",\"\",40/1.2)","v":33.333333333333336},{"$f":"IF(B48=\"\",\"\",ISEVEN(B48))","v":true},{"$f":"IF(B48=\"\",\"\",IF(W48=TRUE,IF(F48=\"I\",\"TAK\",\"NIE\"),IF(F48=\"I\",\"NIE\",IF(F48=\"III\",\"NIE\",\"TAK\"))))","v":"NIE"},{"$f":"IF(B48=\"\",\"\",IF(AND(X48=\"NIE\",Z48=\"NIE\"),\"TAK\",\"NIE\"))","v":"TAK"},{"$f":"IF(B48=\"\",\"\",IF(F48=\"III\",\"TAK\",\"NIE\"))","v":"NIE"},{"$f":"IF(E48=\"\",\"\",IF(X48=\"TAK\",\"Zmiana A\",IF(Y48=\"TAK\",\"Zmiana B\",\"Zmiana C\")))","v":"Zmiana B"}]
[{"$f":"IF(E49=\"\",\"\",TEXT(WEEKDAY(IF(E49=0,\"\",E49),1),\"dddd\"))","v":"sobota"},{"$f":"IF(E49=\"\",\"\",WEEKNUM(IF(E49=0,\"\",E49),1))","v":4},{"$f":"IF(E49=\"\",\"\",TEXT(IF(E49=0,\"\",MONTH(E49))*30,\"mmmm\"))","v":"styczeń"},{"$f":"YEAR(Tabela2[[#This Row],[Data]])","v":2018},"2018-01-27","I",8105,7371,30,31.974846022241231,1.0658282007413744,30.24251119574533,1.0080837065248442,4.0949999999999998,0.24420024420024419,15,3.8390624999999998,0.26048026048026046,16,{"$f":"IF(E49=\"\",\"\",I49*60*N49)","v":7371},{"$f":"IF(E49=\"\",\"\",(I49+I49/7.5*0.5)*3600)","v":115200},{"$f":"IF(E49=\"\",\"\",40/1.2)","v":33.333333333333336},{"$f":"IF(B49=\"\",\"\",ISEVEN(B49))","v":true},{"$f":"IF(B49=\"\",\"\",IF(W49=TRUE,IF(F49=\"I\",\"TAK\",\"NIE\"),IF(F49=\"I\",\"NIE\",IF(F49=\"III\",\"NIE\",\"TAK\"))))","v":"TAK"},{"$f":"IF(B49=\"\",\"\",IF(AND(X49=\"NIE\",Z49=\"NIE\"),\"TAK\",\"NIE\"))","v":"NIE"},{"$f":"IF(B49=\"\",\"\",IF(F49=\"III\",\"TAK\",\"NIE\"))","v":"NIE"},{"$f":"IF(E49=\"\",\"\",IF(X49=\"TAK\",\"Zmiana A\",IF(Y49=\"TAK\",\"Zmiana B\",\"Zmiana C\")))","v":"Zmiana A"}]
["poniedziałek",5,"styczeń",{"$f":"YEAR(Tabela2[[#This Row],[Data]])","v":2018},"2018-01-29","I",1868,1192,30,45.252818786636475,1.5084272928878826,46.307749131656266,1.5435916377218755,3.8644444444444446,0.25876940770557794,16,3.6229166666666668,0.27602070155261643,17,{"$f":"IF(E50=\"\",\"\",I50*60*N50)","v":6956},{"$f":"IF(E50=\"\",\"\",(I50+I50/7.5*0.5)*3600)","v":115200},{"$f":"IF(E50=\"\",\"\",40/1.2)","v":33.333333333333336},{"$f":"IF(B50=\"\",\"\",ISEVEN(B50))","v":false},{"$f":"IF(B50=\"\",\"\",IF(W50=TRUE,IF(F50=\"I\",\"TAK\",\"NIE\"),IF(F50=\"I\",\"NIE\",IF(F50=\"III\",\"NIE\",\"TAK\"))))","v":"NIE"},{"$f":"IF(B50=\"\",\"\",IF(AND(X50=\"NIE\",Z50=\"NIE\"),\"TAK\",\"NIE\"))","v":"TAK"},{"$f":"IF(B50=\"\",\"\",IF(F50=\"III\",\"TAK\",\"NIE\"))","v":"NIE"},{"$f":"IF(E50=\"\",\"\",IF(X50=\"TAK\",\"Zmiana A\",IF(Y50=\"TAK\",\"Zmiana B\",\"Zmiana C\")))","v":"Zmiana B"}]
["poniedziałek",5,"styczeń",{"$f":"YEAR(Tabela2[[#This Row],[Data]])","v":2018},"2018-01-29","II",8234,6956,22.5,16.334920634920636,0.72599647266313938,18.111384532709501,0.8049504236759778,0.88296296296296295,1.1325503355704698,68,0.82777777777777772,1.2080536912751678,72,{"$f":"IF(E51=\"\",\"\",I51*60*N51)","v":1192},{"$f":"IF(E51=\"\",\"\",(I51+I51/7.5*0.5)*3600)","v":86400},{"$f":"IF(E51=\"\",\"\",40/1.2)","v":33.333333333333336},{"$f":"IF(B51=\"\",\"\",ISEVEN(B51))","v":false},{"$f":"IF(B51=\"\",\"\",IF(W51=TRUE,IF(F51=\"I\",\"TAK\",\"NIE\"),IF(F51=\"I\",\"NIE\",IF(F51=\"III\",\"NIE\",\"TAK\"))))","v":"TAK"},{"$f":"IF(B51=\"\",\"\",IF(AND(X51=\"NIE\",Z51=\"NIE\"),\"TAK\",\"NIE\"))","v":"NIE"},{"$f":"IF(B51=\"\",\"\",IF(F51=\"III\",\"TAK\",\"NIE\"))","v":"NIE"},{"$f":"IF(E51=\"\",\"\",IF(X51=\"TAK\",\"Zmiana A\",IF(Y51=\"TAK\",\"Zmiana B\",\"Zmiana C\")))","v":"Zmiana A"}]
["poniedziałek",5,"styczeń",{"$f":"YEAR(Tabela2[[#This Row],[Data]])","v":2018},"2018-01-29","III",4172,3642,22.5,24.736268343815514,1.0993897041695784,24.172573415391163,1.0743365962396072,2.6977777777777776,0.37067545304777594,22,2.5291666666666668,0.39538714991762769,24,{"$f":"IF(E52=\"\",\"\",I52*60*N52)","v":3641.9999999999995},{"$f":"IF(E52=\"\",\"\",(I52+I52/7.5*0.5)*3600)","v":86400},{"$f":"IF(E52=\"\",\"\",40/1.2)","v":33.333333333333336},{"$f":"IF(B52=\"\",\"\",ISEVEN(B52))","v":false},{"$f":"IF(B52=\"\",\"\",IF(W52=TRUE,IF(F52=\"I\",\"TAK\",\"NIE\"),IF(F52=\"I\",\"NIE\",IF(F52=\"III\",\"NIE\",\"TAK\"))))","v":"NIE"},{"$f":"IF(B52=\"\",\"\",IF(AND(X52=\"NIE\",Z52=\"NIE\"),\"TAK\",\"NIE\"))","v":"NIE"},{"$f":"IF(B52=\"\",\"\",IF(F52=\"III\",\"TAK\",\"NIE\"))","v":"TAK"},{"$f":"IF(E52=\"\",\"\",IF(X52=\"TAK\",\"Zmiana A\",IF(Y52=\"TAK\",\"Zmiana B\",\"Zmiana C\")))","v":"Zmiana C"}]
["wtorek",5,"styczeń",{"$f":"YEAR(Tabela2[[#This Row],[Data]])","v":2018},"2018-01-30","I",2213,1732,30,29.297536460304411,0.97658454867681366,27.89622972313034,0.92987432410434467,2.69,0.37174721189591076,22,2.5218750000000001,0.39653035935563818,24,{"$f":"IF(E53=\"\",\"\",I53*60*N53)","v":4842},{"$f":"IF(E53=\"\",\"\",(I53+I53/7.5*0.5)*3600)","v":115200},{"$f":"IF(E53=\"\",\"\",40/1.2)","v":33.333333333333336},{"$f":"IF(B53=\"\",\"\",ISEVEN(B53))","v":false},{"$f":"IF(B53=\"\",\"\",IF(W53=TRUE,IF(F53=\"I\",\"TAK\",\"NIE\"),IF(F53=\"I\",\"NIE\",IF(F53=\"III\",\"NIE\",\"TAK\"))))","v":"NIE"},{"$f":"IF(B53=\"\",\"\",IF(AND(X53=\"NIE\",Z53=\"NIE\"),\"TAK\",\"NIE\"))","v":"TAK"},{"$f":"IF(B53=\"\",\"\",IF(F53=\"III\",\"TAK\",\"NIE\"))","v":"NIE"},{"$f":"IF(E53=\"\",\"\",IF(X53=\"TAK\",\"Zmiana A\",IF(Y53=\"TAK\",\"Zmiana B\",\"Zmiana C\")))","v":"Zmiana B"}]
["wtorek",5,"styczeń",{"$f":"YEAR(Tabela2[[#This Row],[Data]])","v":2018},"2018-01-30","II",6756,4842,22.5,19.468502964426879,0.86526679841897236,18.496812542485969,0.8220805574438208,1.2829629629629629,0.77944572748267893,47,1.2027777777777777,0.8314087759815243,50,{"$f":"IF(E54=\"\",\"\",I54*60*N54)","v":1731.9999999999998},{"$f":"IF(E54=\"\",\"\",(I54+I54/7.5*0.5)*3600)","v":86400},{"$f":"IF(E54=\"\",\"\",40/1.2)","v":33.333333333333336},{"$f":"IF(B54=\"\",\"\",ISEVEN(B54))","v":false},{"$f":"IF(B54=\"\",\"\",IF(W54=TRUE,IF(F54=\"I\",\"TAK\",\"NIE\"),IF(F54=\"I\",\"NIE\",IF(F54=\"III\",\"NIE\",\"TAK\"))))","v":"TAK"},{"$f":"IF(B54=\"\",\"\",IF(AND(X54=\"NIE\",Z54=\"NIE\"),\"TAK\",\"NIE\"))","v":"NIE"},{"$f":"IF(B54=\"\",\"\",IF(F54=\"III\",\"TAK\",\"NIE\"))","v":"NIE"},{"$f":"IF(E54=\"\",\"\",IF(X54=\"TAK\",\"Zmiana A\",IF(Y54=\"TAK\",\"Zmiana B\",\"Zmiana C\")))","v":"Zmiana A"}]
[{"$f":"IF(E55=\"\",\"\",TEXT(WEEKDAY(IF(E55=0,\"\",E55),1),\"dddd\"))","v":"wtorek"},{"$f":"IF(E55=\"\",\"\",WEEKNUM(IF(E55=0,\"\",E55),1))","v":5},{"$f":"IF(E55=\"\",\"\",TEXT(IF(E55=0,\"\",MONTH(E55))*30,\"mmmm\"))","v":"styczeń"},{"$f":"YEAR(Tabela2[[#This Row],[Data]])","v":2018},"2018-01-30","III",4496,3979,22.5,25.550560224089637,1.1355804544039838,25.730607501087135,1.1435825556038728,2.9474074074074075,0.33928122643880371,20,2.7631944444444443,0.36189997486805731,22,{"$f":"IF(E55=\"\",\"\",I55*60*N55)","v":3979},{"$f":"IF(E55=\"\",\"\",(I55+I55/7.5*0.5)*3600)","v":86400},{"$f":"IF(E55=\"\",\"\",40/1.2)","v":33.333333333333336},{"$f":"IF(B55=\"\",\"\",ISEVEN(B55))","v":false},{"$f":"IF(B55=\"\",\"\",IF(W55=TRUE,IF(F55=\"I\",\"TAK\",\"NIE\"),IF(F55=\"I\",\"NIE\",IF(F55=\"III\",\"NIE\",\"TAK\"))))","v":"NIE"},{"$f":"IF(B55=\"\",\"\",IF(AND(X55=\"NIE\",Z55=\"NIE\"),\"TAK\",\"NIE\"))","v":"NIE"},{"$f":"IF(B55=\"\",\"\",IF(F55=\"III\",\"TAK\",\"NIE\"))","v":"TAK"},{"$f":"IF(E55=\"\",\"\",IF(X55=\"TAK\",\"Zmiana A\",IF(Y55=\"TAK\",\"Zmiana B\",\"Zmiana C\")))","v":"Zmiana C"}]
["środa",5,"styczeń",{"$f":"YEAR(Tabela2[[#This Row],[Data]])","v":2018},"2018-01-31","I",2362,1784,30,30.983562826460961,1.0327854275486987,29.67060941797229,0.98902031393240963,2.3505555555555557,0.42543134010872136,26,2.2036458333333333,0.45379342944930279,27,{"$f":"IF(E56=\"\",\"\",I56*60*N56)","v":4231},{"$f":"IF(E56=\"\",\"\",(I56+I56/7.5*0.5)*3600)","v":115200},{"$f":"IF(E56=\"\",\"\",40/1.2)","v":33.333333333333336},{"$f":"IF(B56=\"\",\"\",ISEVEN(B56))","v":false},{"$f":"IF(B56=\"\",\"\",IF(W56=TRUE,IF(F56=\"I\",\"TAK\",\"NIE\"),IF(F56=\"I\",\"NIE\",IF(F56=\"III\",\"NIE\",\"TAK\"))))","v":"NIE"},{"$f":"IF(B56=\"\",\"\",IF(AND(X56=\"NIE\",Z56=\"NIE\"),\"TAK\",\"NIE\"))","v":"TAK"},{"$f":"IF(B56=\"\",\"\",IF(F56=\"III\",\"TAK\",\"NIE\"))","v":"NIE"},{"$f":"IF(E56=\"\",\"\",IF(X56=\"TAK\",\"Zmiana A\",IF(Y56=\"TAK\",\"Zmiana B\",\"Zmiana C\")))","v":"Zmiana B"}]
["środa",5,"styczeń",{"$f":"YEAR(Tabela2[[#This Row],[Data]])","v":2018},"2018-01-31","II",5671,4231,22.5,22.983777852990364,1.0215012379106829,22.073839323891498,0.98105952550628883,1.3214814814814815,0.75672645739910316,45,1.2388888888888889,0.80717488789237668,48,{"$f":"IF(E57=\"\",\"\",I57*60*N57)","v":1784},{"$f":"IF(E57=\"\",\"\",(I57+I57/7.5*0.5)*3600)","v":86400},{"$f":"IF(E57=\"\",\"\",40/1.2)","v":33.333333333333336},{"$f":"IF(B57=\"\",\"\",ISEVEN(B57))","v":false},{"$f":"IF(B57=\"\",\"\",IF(W57=TRUE,IF(F57=\"I\",\"TAK\",\"NIE\"),IF(F57=\"I\",\"NIE\",IF(F57=\"III\",\"NIE\",\"TAK\"))))","v":"TAK"},{"$f":"IF(B57=\"\",\"\",IF(AND(X57=\"NIE\",Z57=\"NIE\"),\"TAK\",\"NIE\"))","v":"NIE"},{"$f":"IF(B57=\"\",\"\",IF(F57=\"III\",\"TAK\",\"NIE\"))","v":"NIE"},{"$f":"IF(E57=\"\",\"\",IF(X57=\"TAK\",\"Zmiana A\",IF(Y57=\"TAK\",\"Zmiana B\",\"Zmiana C\")))","v":"Zmiana A"}]
["środa",5,"styczeń",{"$f":"YEAR(Tabela2[[#This Row],[Data]])","v":2018},"2018-01-31","III",3817,3701,22.5,26.761772825072061,1.1894121255587582,26.075840515894441,1.158926245150864,2.7414814814814816,0.36476627938395029,22,2.5701388888888888,0.38908403134288028,23,{"$f":"IF(E58=\"\",\"\",I58*60*N58)","v":3701},{"$f":"IF(E58=\"\",\"\",(I58+I58/7.5*0.5)*3600)","v":86400},{"$f":"IF(E58=\"\",\"\",40/1.2)","v":33.333333333333336},{"$f":"IF(B58=\"\",\"\",ISEVEN(B58))","v":false},{"$f":"IF(B58=\"\",\"\",IF(W58=TRUE,IF(F58=\"I\",\"TAK\",\"NIE\"),IF(F58=\"I\",\"NIE\",IF(F58=\"III\",\"NIE\",\"TAK\"))))","v":"NIE"},{"$f":"IF(B58=\"\",\"\",IF(AND(X58=\"NIE\",Z58=\"NIE\"),\"TAK\",\"NIE\"))","v":"NIE"},{"$f":"IF(B58=\"\",\"\",IF(F58=\"III\",\"TAK\",\"NIE\"))","v":"TAK"},{"$f":"IF(E58=\"\",\"\",IF(X58=\"TAK\",\"Zmiana A\",IF(Y58=\"TAK\",\"Zmiana B\",\"Zmiana C\")))","v":"Zmiana C"}]
["czwartek",5,"luty",{"$f":"YEAR(Tabela2[[#This Row],[Data]])","v":2018},"2018-02-01","I",2149,1753,30,29.058259604654868,0.86860865348849559,22.690048735358019,0.75633495784526728,2.3511111111111109,0.42533081285444235,26,2.2041666666666666,0.45368620037807184,27,{"$f":"IF(E59=\"\",\"\",I59*60*N59)","v":4232},{"$f":"IF(E59=\"\",\"\",(I59+I59/7.5*0.5)*3600)","v":115200},{"$f":"IF(E59=\"\",\"\",40/1.2)","v":33.333333333333336},{"$f":"IF(B59=\"\",\"\",ISEVEN(B59))","v":false},{"$f":"IF(B59=\"\",\"\",IF(W59=TRUE,IF(F59=\"I\",\"TAK\",\"NIE\"),IF(F59=\"I\",\"NIE\",IF(F59=\"III\",\"NIE\",\"TAK\"))))","v":"NIE"},{"$f":"IF(B59=\"\",\"\",IF(AND(X59=\"NIE\",Z59=\"NIE\"),\"TAK\",\"NIE\"))","v":"TAK"},{"$f":"IF(B59=\"\",\"\",IF(F59=\"III\",\"TAK\",\"NIE\"))","v":"NIE"},{"$f":"IF(E59=\"\",\"\",IF(X59=\"TAK\",\"Zmiana A\",IF(Y59=\"TAK\",\"Zmiana B\",\"Zmiana C\")))","v":"Zmiana B"}]
["czwartek",5,"luty",{"$f":"YEAR(Tabela2[[#This Row],[Data]])","v":2018},"2018-02-01","II",6183,4232,30,25.255978628099143,0.74186595426997148,19.356606415096699,0.6452202138365567,0.97388888888888892,1.0268111808328579,62,0.91302083333333328,1.0952652595550485,66,{"$f":"IF(E60=\"\",\"\",I60*60*N60)","v":1753},{"$f":"IF(E60=\"\",\"\",(I60+I60/7.5*0.5)*3600)","v":115200},{"$f":"IF(E60=\"\",\"\",40/1.2)","v":33.333333333333336},{"$f":"IF(B60=\"\",\"\",ISEVEN(B60))","v":false},{"$f":"IF(B60=\"\",\"\",IF(W60=TRUE,IF(F60=\"I\",\"TAK\",\"NIE\"),IF(F60=\"I\",\"NIE\",IF(F60=\"III\",\"NIE\",\"TAK\"))))","v":"TAK"},{"$f":"IF(B60=\"\",\"\",IF(AND(X60=\"NIE\",Z60=\"NIE\"),\"TAK\",\"NIE\"))","v":"NIE"},{"$f":"IF(B60=\"\",\"\",IF(F60=\"III\",\"TAK\",\"NIE\"))","v":"NIE"},{"$f":"IF(E60=\"\",\"\",IF(X60=\"TAK\",\"Zmiana A\",IF(Y60=\"TAK\",\"Zmiana B\",\"Zmiana C\")))","v":"Zmiana A"}]
[{"$f":"IF(E61=\"\",\"\",TEXT(WEEKDAY(IF(E61=0,\"\",E61),1),\"dddd\"))","v":"czwartek"},{"$f":"IF(E61=\"\",\"\",WEEKNUM(IF(E61=0,\"\",E61),1))","v":5},{"$f":"IF(E61=\"\",\"\",TEXT(IF(E61=0,\"\",MONTH(E61))*30,\"mmmm\"))","v":"luty"},{"$f":"YEAR(Tabela2[[#This Row],[Data]])","v":2018},"2018-02-01","III",4195,3438,22.5,21.97173507083993,0.84318822537066351,14.097623217200887,0.62656103187559498,2.5466666666666669,0.39267015706806285,24,2.3875000000000002,0.41884816753926701,25,{"$f":"IF(E61=\"\",\"\",I61*60*N61)","v":3438.0000000000005},{"$f":"IF(E61=\"\",\"\",(I61+I61/7.5*0.5)*3600)","v":86400},{"$f":"IF(E61=\"\",\"\",40/1.2)","v":33.333333333333336},{"$f":"IF(B61=\"\",\"\",ISEVEN(B61))","v":false},{"$f":"IF(B61=\"\",\"\",IF(W61=TRUE,IF(F61=\"I\",\"TAK\",\"NIE\"),IF(F61=\"I\",\"NIE\",IF(F61=\"III\",\"NIE\",\"TAK\"))))","v":"NIE"},{"$f":"IF(B61=\"\",\"\",IF(AND(X61=\"NIE\",Z61=\"NIE\"),\"TAK\",\"NIE\"))","v":"NIE"},{"$f":"IF(B61=\"\",\"\",IF(F61=\"III\",\"TAK\",\"NIE\"))","v":"TAK"},{"$f":"IF(E61=\"\",\"\",IF(X61=\"TAK\",\"Zmiana A\",IF(Y61=\"TAK\",\"Zmiana B\",\"Zmiana C\")))","v":"Zmiana C"}]
["piątek",5,"luty",{"$f":"YEAR(Tabela2[[#This Row],[Data]])","v":2018},"2018-02-02","I",2677,1743,22.5,21.457599236181878,0.82033774383030567,16.924608767450664,0.75220483410891836,1.2911111111111111,0.77452667814113596,46,1.2104166666666667,0.82616179001721168,50,{"$f":"IF(E62=\"\",\"\",I62*60*N62)","v":1743},{"$f":"IF(E62=\"\",\"\",(I62+I62/7.5*0.5)*3600)","v":86400},{"$f":"IF(E62=\"\",\"\",40/1.2)","v":33.333333333333336},{"$f":"IF(B62=\"\",\"\",ISEVEN(B62))","v":false},{"$f":"IF(B62=\"\",\"\",IF(W62=TRUE,IF(F62=\"I\",\"TAK\",\"NIE\"),IF(F62=\"I\",\"NIE\",IF(F62=\"III\",\"NIE\",\"TAK\"))))","v":"NIE"},{"$f":"IF(B62=\"\",\"\",IF(AND(X62=\"NIE\",Z62=\"NIE\"),\"TAK\",\"NIE\"))","v":"TAK"},{"$f":"IF(B62=\"\",\"\",IF(F62=\"III\",\"TAK\",\"NIE\"))","v":"NIE"},{"$f":"IF(E62=\"\",\"\",IF(X62=\"TAK\",\"Zmiana A\",IF(Y62=\"TAK\",\"Zmiana B\",\"Zmiana C\")))","v":"Zmiana B"}]
["piątek",5,"luty",{"$f":"YEAR(Tabela2[[#This Row],[Data]])","v":2018},"2018-02-02","II",3184,1743,22.5,23.426631493506491,0.90785028860028849,16.247216655193682,0.72209851800860814,1.2911111111111111,0.77452667814113596,46,1.2104166666666667,0.82616179001721168,50,{"$f":"IF(E63=\"\",\"\",I63*60*N63)","v":1743},{"$f":"IF(E63=\"\",\"\",(I63+I63/7.5*0.5)*3600)","v":86400},{"$f":"IF(E63=\"\",\"\",40/1.2)","v":33.333333333333336},{"$f":"IF(B63=\"\",\"\",ISEVEN(B63))","v":false},{"$f":"IF(B63=\"\",\"\",IF(W63=TRUE,IF(F63=\"I\",\"TAK\",\"NIE\"),IF(F63=\"I\",\"NIE\",IF(F63=\"III\",\"NIE\",\"TAK\"))))","v":"TAK"},{"$f":"IF(B63=\"\",\"\",IF(AND(X63=\"NIE\",Z63=\"NIE\"),\"TAK\",\"NIE\"))","v":"NIE"},{"$f":"IF(B63=\"\",\"\",IF(F63=\"III\",\"TAK\",\"NIE\"))","v":"NIE"},{"$f":"IF(E63=\"\",\"\",IF(X63=\"TAK\",\"Zmiana A\",IF(Y63=\"TAK\",\"Zmiana B\",\"Zmiana C\")))","v":"Zmiana A"}]
["piątek",5,"luty",{"$f":"YEAR(Tabela2[[#This Row],[Data]])","v":2018},"2018-02-02","III",3042,2537,15,15.869047619047617,0.85793650793650778,10.515944959557121,0.70106299730380806,2.818888888888889,0.35474970437524633,21,2.6427083333333332,0.37839968466692947,23,{"$f":"IF(E64=\"\",\"\",I64*60*N64)","v":2537},{"$f":"IF(E64=\"\",\"\",(I64+I64/7.5*0.5)*3600)","v":57600},{"$f":"IF(E64=\"\",\"\",40/1.2)","v":33.333333333333336},{"$f":"IF(B64=\"\",\"\",ISEVEN(B64))","v":false},{"$f":"IF(B64=\"\",\"\",IF(W64=TRUE,IF(F64=\"I\",\"TAK\",\"NIE\"),IF(F64=\"I\",\"NIE\",IF(F64=\"III\",\"NIE\",\"TAK\"))))","v":"NIE"},{"$f":"IF(B64=\"\",\"\",IF(AND(X64=\"NIE\",Z64=\"NIE\"),\"TAK\",\"NIE\"))","v":"NIE"},{"$f":"IF(B64=\"\",\"\",IF(F64=\"III\",\"TAK\",\"NIE\"))","v":"TAK"},{"$f":"IF(E64=\"\",\"\",IF(X64=\"TAK\",\"Zmiana A\",IF(Y64=\"TAK\",\"Zmiana B\",\"Zmiana C\")))","v":"Zmiana C"}]
["poniedziałek",6,"luty",{"$f":"YEAR(Tabela2[[#This Row],[Data]])","v":2018},"2018-02-05","I",5118,3790,30,27.637301828053033,0.8212433942684344,22.716453796722085,0.75721512655740286,2.1055555555555556,0.47493403693931396,28,1.9739583333333333,0.50659630606860162,30,{"$f":"IF(E65=\"\",\"\",I65*60*N65)","v":3790},{"$f":"IF(E65=\"\",\"\",(I65+I65/7.5*0.5)*3600)","v":115200},{"$f":"IF(E65=\"\",\"\",40/1.2)","v":33.333333333333336},{"$f":"IF(B65=\"\",\"\",ISEVEN(B65))","v":true},{"$f":"IF(B65=\"\",\"\",IF(W65=TRUE,IF(F65=\"I\",\"TAK\",\"NIE\"),IF(F65=\"I\",\"NIE\",IF(F65=\"III\",\"NIE\",\"TAK\"))))","v":"TAK"},{"$f":"IF(B65=\"\",\"\",IF(AND(X65=\"NIE\",Z65=\"NIE\"),\"TAK\",\"NIE\"))","v":"NIE"},{"$f":"IF(B65=\"\",\"\",IF(F65=\"III\",\"TAK\",\"NIE\"))","v":"NIE"},{"$f":"IF(E65=\"\",\"\",IF(X65=\"TAK\",\"Zmiana A\",IF(Y65=\"TAK\",\"Zmiana B\",\"Zmiana C\")))","v":"Zmiana A"}]
["poniedziałek",6,"luty",{"$f":"YEAR(Tabela2[[#This Row],[Data]])","v":2018},"2018-02-05","II",2060,1362,22.5,17.281746031746032,0.63474426807760143,12.076160052228449,0.53671822454348661,1.0088888888888889,0.99118942731277537,59,0.9458333333333333,1.0572687224669604,63,{"$f":"IF(E66=\"\",\"\",I66*60*N66)","v":1362},{"$f":"IF(E66=\"\",\"\",(I66+I66/7.5*0.5)*3600)","v":86400},{"$f":"IF(E66=\"\",\"\",40/1.2)","v":33.333333333333336},{"$f":"IF(B66=\"\",\"\",ISEVEN(B66))","v":true},{"$f":"IF(B66=\"\",\"\",IF(W66=TRUE,IF(F66=\"I\",\"TAK\",\"NIE\"),IF(F66=\"I\",\"NIE\",IF(F66=\"III\",\"NIE\",\"TAK\"))))","v":"NIE"},{"$f":"IF(B66=\"\",\"\",IF(AND(X66=\"NIE\",Z66=\"NIE\"),\"TAK\",\"NIE\"))","v":"TAK"},{"$f":"IF(B66=\"\",\"\",IF(F66=\"III\",\"TAK\",\"NIE\"))","v":"NIE"},{"$f":"IF(E66=\"\",\"\",IF(X66=\"TAK\",\"Zmiana A\",IF(Y66=\"TAK\",\"Zmiana B\",\"Zmiana C\")))","v":"Zmiana B"}]
[{"$f":"IF(E67=\"\",\"\",TEXT(WEEKDAY(IF(E67=0,\"\",E67),1),\"dddd\"))","v":"wtorek"},{"$f":"IF(E67=\"\",\"\",WEEKNUM(IF(E67=0,\"\",E67),1))","v":6},{"$f":"IF(E67=\"\",\"\",TEXT(IF(E67=0,\"\",MONTH(E67))*30,\"mmmm\"))","v":"luty"},{"$f":"YEAR(Tabela2[[#This Row],[Data]])","v":2018},"2018-02-06","III",5059,4957,7.5,10.507936507936508,1.001058201058201,5.4612056798016937,0.72816075730689245,5.3244444444444445,0.18781302170283806,11,4.9916666666666663,0.20033388981636061,12,{"$f":"IF(E67=\"\",\"\",I67*60*N67)","v":2396},{"$f":"IF(E67=\"\",\"\",(I67+I67/7.5*0.5)*3600)","v":28800},{"$f":"IF(E67=\"\",\"\",40/1.2)","v":33.333333333333336},{"$f":"IF(B67=\"\",\"\",ISEVEN(B67))","v":true},{"$f":"IF(B67=\"\",\"\",IF(W67=TRUE,IF(F67=\"I\",\"TAK\",\"NIE\"),IF(F67=\"I\",\"NIE\",IF(F67=\"III\",\"NIE\",\"TAK\"))))","v":"NIE"},{"$f":"IF(B67=\"\",\"\",IF(AND(X67=\"NIE\",Z67=\"NIE\"),\"TAK\",\"NIE\"))","v":"NIE"},{"$f":"IF(B67=\"\",\"\",IF(F67=\"III\",\"TAK\",\"NIE\"))","v":"TAK"},{"$f":"IF(E67=\"\",\"\",IF(X67=\"TAK\",\"Zmiana A\",IF(Y67=\"TAK\",\"Zmiana B\",\"Zmiana C\")))","v":"Zmiana C"}]
["wtorek",6,"luty",{"$f":"YEAR(Tabela2[[#This Row],[Data]])","v":2018},"2018-02-06","I",5526,6226,27.5,32.275025721692927,1.0645463898797427,27.908610943491265,1.0148585797633187,2.3236363636363637,0.43035993740219092,26,2.13,0.46948356807511737,28,{"$f":"IF(E68=\"\",\"\",I68*60*N68)","v":3834},{"$f":"IF(E68=\"\",\"\",(I68+I68/7.5*0.5)*3600)","v":105600},{"$f":"IF(E68=\"\",\"\",40/1.2)","v":33.333333333333336},{"$f":"IF(B68=\"\",\"\",ISEVEN(B68))","v":true},{"$f":"IF(B68=\"\",\"\",IF(W68=TRUE,IF(F68=\"I\",\"TAK\",\"NIE\"),IF(F68=\"I\",\"NIE\",IF(F68=\"III\",\"NIE\",\"TAK\"))))","v":"TAK"},{"$f":"IF(B68=\"\",\"\",IF(AND(X68=\"NIE\",Z68=\"NIE\"),\"TAK\",\"NIE\"))","v":"NIE"},{"$f":"IF(B68=\"\",\"\",IF(F68=\"III\",\"TAK\",\"NIE\"))","v":"NIE"},{"$f":"IF(E68=\"\",\"\",IF(X68=\"TAK\",\"Zmiana A\",IF(Y68=\"TAK\",\"Zmiana B\",\"Zmiana C\")))","v":"Zmiana A"}]
["wtorek",6,"luty",{"$f":"YEAR(Tabela2[[#This Row],[Data]])","v":2018},"2018-02-06","II",1842,2092,22.5,16.743682795698923,0.61083034647550771,12.179907627763336,0.54132922790059268,0.8792592592592593,1.1373209772535804,68,0.82430555555555551,1.2131423757371524,73,{"$f":"IF(E69=\"\",\"\",I69*60*N69)","v":1187},{"$f":"IF(E69=\"\",\"\",(I69+I69/7.5*0.5)*3600)","v":86400},{"$f":"IF(E69=\"\",\"\",40/1.2)","v":33.333333333333336},{"$f":"IF(B69=\"\",\"\",ISEVEN(B69))","v":true},{"$f":"IF(B69=\"\",\"\",IF(W69=TRUE,IF(F69=\"I\",\"TAK\",\"NIE\"),IF(F69=\"I\",\"NIE\",IF(F69=\"III\",\"NIE\",\"TAK\"))))","v":"NIE"},{"$f":"IF(B69=\"\",\"\",IF(AND(X69=\"NIE\",Z69=\"NIE\"),\"TAK\",\"NIE\"))","v":"TAK"},{"$f":"IF(B69=\"\",\"\",IF(F69=\"III\",\"TAK\",\"NIE\"))","v":"NIE"},{"$f":"IF(E69=\"\",\"\",IF(X69=\"TAK\",\"Zmiana A\",IF(Y69=\"TAK\",\"Zmiana B\",\"Zmiana C\")))","v":"Zmiana B"}]
["wtorek",6,"luty",{"$f":"YEAR(Tabela2[[#This Row],[Data]])","v":2018},"2018-02-06","III",5059,4957,7.5,10.257936507936508,0.96772486772486777,2.5475820670240079,0.33967760893653437,5.1844444444444449,0.19288469781397344,12,4.8604166666666666,0.20574367766823831,12,{"$f":"IF(E70=\"\",\"\",I70*60*N70)","v":2333},{"$f":"IF(E70=\"\",\"\",(I70+I70/7.5*0.5)*3600)","v":28800},{"$f":"IF(E70=\"\",\"\",40/1.2)","v":33.333333333333336},{"$f":"IF(B70=\"\",\"\",ISEVEN(B70))","v":true},{"$f":"IF(B70=\"\",\"\",IF(W70=TRUE,IF(F70=\"I\",\"TAK\",\"NIE\"),IF(F70=\"I\",\"NIE\",IF(F70=\"III\",\"NIE\",\"TAK\"))))","v":"NIE"},{"$f":"IF(B70=\"\",\"\",IF(AND(X70=\"NIE\",Z70=\"NIE\"),\"TAK\",\"NIE\"))","v":"NIE"},{"$f":"IF(B70=\"\",\"\",IF(F70=\"III\",\"TAK\",\"NIE\"))","v":"TAK"},{"$f":"IF(E70=\"\",\"\",IF(X70=\"TAK\",\"Zmiana A\",IF(Y70=\"TAK\",\"Zmiana B\",\"Zmiana C\")))","v":"Zmiana C"}]
["środa",6,"luty",{"$f":"YEAR(Tabela2[[#This Row],[Data]])","v":2018},"2018-02-07","I",5924,6324,41,43.016303756973748,0.97600740870667679,36.198456090792341,0.88288917294615465,2.0284552845528454,0.49298597194388777,30,1.8901515151515151,0.5290581162324649,32,{"$f":"IF(E71=\"\",\"\",I71*60*N71)","v":4990},{"$f":"IF(E71=\"\",\"\",(I71+I71/7.5*0.5)*3600)","v":157440},{"$f":"IF(E71=\"\",\"\",40/1.2)","v":33.333333333333336},{"$f":"IF(B71=\"\",\"\",ISEVEN(B71))","v":true},{"$f":"IF(B71=\"\",\"\",IF(W71=TRUE,IF(F71=\"I\",\"TAK\",\"NIE\"),IF(F71=\"I\",\"NIE\",IF(F71=\"III\",\"NIE\",\"TAK\"))))","v":"TAK"},{"$f":"IF(B71=\"\",\"\",IF(AND(X71=\"NIE\",Z71=\"NIE\"),\"TAK\",\"NIE\"))","v":"NIE"},{"$f":"IF(B71=\"\",\"\",IF(F71=\"III\",\"TAK\",\"NIE\"))","v":"NIE"},{"$f":"IF(E71=\"\",\"\",IF(X71=\"TAK\",\"Zmiana A\",IF(Y71=\"TAK\",\"Zmiana B\",\"Zmiana C\")))","v":"Zmiana A"}]
["środa",6,"luty",{"$f":"YEAR(Tabela2[[#This Row],[Data]])","v":2018},"2018-02-07","II",1913,2263,22.5,18.803675856307436,0.70238559361366382,10.905680358963805,0.48469690484283579,0.78,1.2820512820512822,77,0.73124999999999996,1.3675213675213675,82,{"$f":"IF(E72=\"\",\"\",I72*60*N72)","v":1053},{"$f":"IF(E72=\"\",\"\",(I72+I72/7.5*0.5)*3600)","v":86400},{"$f":"IF(E72=\"\",\"\",40/1.2)","v":33.333333333333336},{"$f":"IF(B72=\"\",\"\",ISEVEN(B72))","v":true},{"$f":"IF(B72=\"\",\"\",IF(W72=TRUE,IF(F72=\"I\",\"TAK\",\"NIE\"),IF(F72=\"I\",\"NIE\",IF(F72=\"III\",\"NIE\",\"TAK\"))))","v":"NIE"},{"$f":"IF(B72=\"\",\"\",IF(AND(X72=\"NIE\",Z72=\"NIE\"),\"TAK\",\"NIE\"))","v":"TAK"},{"$f":"IF(B72=\"\",\"\",IF(F72=\"III\",\"TAK\",\"NIE\"))","v":"NIE"},{"$f":"IF(E72=\"\",\"\",IF(X72=\"TAK\",\"Zmiana A\",IF(Y72=\"TAK\",\"Zmiana B\",\"Zmiana C\")))","v":"Zmiana B"}]
[{"$f":"IF(E73=\"\",\"\",TEXT(WEEKDAY(IF(E73=0,\"\",E73),1),\"dddd\"))","v":"środa"},{"$f":"IF(E73=\"\",\"\",WEEKNUM(IF(E73=0,\"\",E73),1))","v":6},{"$f":"IF(E73=\"\",\"\",TEXT(IF(E73=0,\"\",MONTH(E73))*30,\"mmmm\"))","v":"luty"},{"$f":"YEAR(Tabela2[[#This Row],[Data]])","v":2018},"2018-02-07","III",2429,2479,7.5,10.507936507936508,1.001058201058201,3.3732723120666783,0.44976964160889044,5.3244444444444445,0.18781302170283806,11,4.9916666666666663,0.20033388981636061,12,{"$f":"IF(E73=\"\",\"\",I73*60*N73)","v":2396},{"$f":"IF(E73=\"\",\"\",(I73+I73/7.5*0.5)*3600)","v":28800},{"$f":"IF(E73=\"\",\"\",40/1.2)","v":33.333333333333336},{"$f":"IF(B73=\"\",\"\",ISEVEN(B73))","v":true},{"$f":"IF(B73=\"\",\"\",IF(W73=TRUE,IF(F73=\"I\",\"TAK\",\"NIE\"),IF(F73=\"I\",\"NIE\",IF(F73=\"III\",\"NIE\",\"TAK\"))))","v":"NIE"},{"$f":"IF(B73=\"\",\"\",IF(AND(X73=\"NIE\",Z73=\"NIE\"),\"TAK\",\"NIE\"))","v":"NIE"},{"$f":"IF(B73=\"\",\"\",IF(F73=\"III\",\"TAK\",\"NIE\"))","v":"TAK"},{"$f":"IF(E73=\"\",\"\",IF(X73=\"TAK\",\"Zmiana A\",IF(Y73=\"TAK\",\"Zmiana B\",\"Zmiana C\")))","v":"Zmiana C"}]
["czwartek",6,"luty",{"$f":"YEAR(Tabela2[[#This Row],[Data]])","v":2018},"2018-02-08","I",7841,8491,43,49.789207440431909,1.0881211032658584,43.832269235915078,1.0193550985096529,2.5891472868217056,0.38622754491017963,23,2.4202898550724639,0.41317365269461076,25,{"$f":"IF(E74=\"\",\"\",I74*60*N74)","v":6680},{"$f":"IF(E74=\"\",\"\",(I74+I74/7.5*0.5)*3600)","v":165120},{"$f":"IF(E74=\"\",\"\",40/1.2)","v":33.333333333333336},{"$f":"IF(B74=\"\",\"\",ISEVEN(B74))","v":true},{"$f":"IF(B74=\"\",\"\",IF(W74=TRUE,IF(F74=\"I\",\"TAK\",\"NIE\"),IF(F74=\"I\",\"NIE\",IF(F74=\"III\",\"NIE\",\"TAK\"))))","v":"TAK"},{"$f":"IF(B74=\"\",\"\",IF(AND(X74=\"NIE\",Z74=\"NIE\"),\"TAK\",\"NIE\"))","v":"NIE"},{"$f":"IF(B74=\"\",\"\",IF(F74=\"III\",\"TAK\",\"NIE\"))","v":"NIE"},{"$f":"IF(E74=\"\",\"\",IF(X74=\"TAK\",\"Zmiana A\",IF(Y74=\"TAK\",\"Zmiana B\",\"Zmiana C\")))","v":"Zmiana A"}]
["czwartek",6,"luty",{"$f":"YEAR(Tabela2[[#This Row],[Data]])","v":2018},"2018-02-08","II",1490,1840,15,12.44561507936508,0.62970767195767197,5.692320710913604,0.37948804739424025,0.76777777777777778,1.3024602026049203,78,0.71979166666666672,1.3892908827785817,83,{"$f":"IF(E75=\"\",\"\",I75*60*N75)","v":691},{"$f":"IF(E75=\"\",\"\",(I75+I75/7.5*0.5)*3600)","v":57600},{"$f":"IF(E75=\"\",\"\",40/1.2)","v":33.333333333333336},{"$f":"IF(B75=\"\",\"\",ISEVEN(B75))","v":true},{"$f":"IF(B75=\"\",\"\",IF(W75=TRUE,IF(F75=\"I\",\"TAK\",\"NIE\"),IF(F75=\"I\",\"NIE\",IF(F75=\"III\",\"NIE\",\"TAK\"))))","v":"NIE"},{"$f":"IF(B75=\"\",\"\",IF(AND(X75=\"NIE\",Z75=\"NIE\"),\"TAK\",\"NIE\"))","v":"TAK"},{"$f":"IF(B75=\"\",\"\",IF(F75=\"III\",\"TAK\",\"NIE\"))","v":"NIE"},{"$f":"IF(E75=\"\",\"\",IF(X75=\"TAK\",\"Zmiana A\",IF(Y75=\"TAK\",\"Zmiana B\",\"Zmiana C\")))","v":"Zmiana B"}]
["czwartek",6,"luty",{"$f":"YEAR(Tabela2[[#This Row],[Data]])","v":2018},"2018-02-08","III",2539,2589,7.5,10.503968253968253,1.0005291005291004,2.8490686096857161,0.37987581462476216,5.322222222222222,0.18789144050104384,11,4.989583333333333,0.20041753653444677,12,{"$f":"IF(E76=\"\",\"\",I76*60*N76)","v":2395},{"$f":"IF(E76=\"\",\"\",(I76+I76/7.5*0.5)*3600)","v":28800},{"$f":"IF(E76=\"\",\"\",40/1.2)","v":33.333333333333336},{"$f":"IF(B76=\"\",\"\",ISEVEN(B76))","v":true},{"$f":"IF(B76=\"\",\"\",IF(W76=TRUE,IF(F76=\"I\",\"TAK\",\"NIE\"),IF(F76=\"I\",\"NIE\",IF(F76=\"III\",\"NIE\",\"TAK\"))))","v":"NIE"},{"$f":"IF(B76=\"\",\"\",IF(AND(X76=\"NIE\",Z76=\"NIE\"),\"TAK\",\"NIE\"))","v":"NIE"},{"$f":"IF(B76=\"\",\"\",IF(F76=\"III\",\"TAK\",\"NIE\"))","v":"TAK"},{"$f":"IF(E76=\"\",\"\",IF(X76=\"TAK\",\"Zmiana A\",IF(Y76=\"TAK\",\"Zmiana B\",\"Zmiana C\")))","v":"Zmiana C"}]
["piątek",6,"luty",{"$f":"YEAR(Tabela2[[#This Row],[Data]])","v":2018},"2018-02-09","I",6959,7659,41,45.058991622565813,1.0258290639650198,39.596952849205316,0.96577933778549552,2.03739837398374,0.49082202713487627,29,1.8984848484848484,0.52673583399840385,32,{"$f":"IF(E77=\"\",\"\",I77*60*N77)","v":5012},{"$f":"IF(E77=\"\",\"\",(I77+I77/7.5*0.5)*3600)","v":157440},{"$f":"IF(E77=\"\",\"\",40/1.2)","v":33.333333333333336},{"$f":"IF(B77=\"\",\"\",ISEVEN(B77))","v":true},{"$f":"IF(B77=\"\",\"\",IF(W77=TRUE,IF(F77=\"I\",\"TAK\",\"NIE\"),IF(F77=\"I\",\"NIE\",IF(F77=\"III\",\"NIE\",\"TAK\"))))","v":"TAK"},{"$f":"IF(B77=\"\",\"\",IF(AND(X77=\"NIE\",Z77=\"NIE\"),\"TAK\",\"NIE\"))","v":"NIE"},{"$f":"IF(B77=\"\",\"\",IF(F77=\"III\",\"TAK\",\"NIE\"))","v":"NIE"},{"$f":"IF(E77=\"\",\"\",IF(X77=\"TAK\",\"Zmiana A\",IF(Y77=\"TAK\",\"Zmiana B\",\"Zmiana C\")))","v":"Zmiana A"}]
["piątek",6,"luty",{"$f":"YEAR(Tabela2[[#This Row],[Data]])","v":2018},"2018-02-09","II",1248,1498,15,17.814635767458348,0.98764238449722319,11.737420180953396,0.78249467873022638,1.23,0.81300813008130079,49,1.153125,0.86720867208672092,52,{"$f":"IF(E78=\"\",\"\",I78*60*N78)","v":1107},{"$f":"IF(E78=\"\",\"\",(I78+I78/7.5*0.5)*3600)","v":57600},{"$f":"IF(E78=\"\",\"\",40/1.2)","v":33.333333333333336},{"$f":"IF(B78=\"\",\"\",ISEVEN(B78))","v":true},{"$f":"IF(B78=\"\",\"\",IF(W78=TRUE,IF(F78=\"I\",\"TAK\",\"NIE\"),IF(F78=\"I\",\"NIE\",IF(F78=\"III\",\"NIE\",\"TAK\"))))","v":"NIE"},{"$f":"IF(B78=\"\",\"\",IF(AND(X78=\"NIE\",Z78=\"NIE\"),\"TAK\",\"NIE\"))","v":"TAK"},{"$f":"IF(B78=\"\",\"\",IF(F78=\"III\",\"TAK\",\"NIE\"))","v":"NIE"},{"$f":"IF(E78=\"\",\"\",IF(X78=\"TAK\",\"Zmiana A\",IF(Y78=\"TAK\",\"Zmiana B\",\"Zmiana C\")))","v":"Zmiana B"}]
["piątek",6,"luty",{"$f":"YEAR(Tabela2[[#This Row],[Data]])","v":2018},"2018-02-09","III",2576,2676,7.5,10.523809523809524,1.0031746031746032,6.0666600573256417,0.80888800764341895,5.333333333333333,0.1875,11,5,0.2,12,{"$f":"IF(E79=\"\",\"\",I79*60*N79)","v":2400},{"$f":"IF(E79=\"\",\"\",(I79+I79/7.5*0.5)*3600)","v":28800},{"$f":"IF(E79=\"\",\"\",40/1.2)","v":33.333333333333336},{"$f":"IF(B79=\"\",\"\",ISEVEN(B79))","v":true},{"$f":"IF(B79=\"\",\"\",IF(W79=TRUE,IF(F79=\"I\",\"TAK\",\"NIE\"),IF(F79=\"I\",\"NIE\",IF(F79=\"III\",\"NIE\",\"TAK\"))))","v":"NIE"},{"$f":"IF(B79=\"\",\"\",IF(AND(X79=\"NIE\",Z79=\"NIE\"),\"TAK\",\"NIE\"))","v":"NIE"},{"$f":"IF(B79=\"\",\"\",IF(F79=\"III\",\"TAK\",\"NIE\"))","v":"TAK"},{"$f":"IF(E79=\"\",\"\",IF(X79=\"TAK\",\"Zmiana A\",IF(Y79=\"TAK\",\"Zmiana B\",\"Zmiana C\")))","v":"Zmiana C"}]
[{"$f":"IF(E80=\"\",\"\",TEXT(WEEKDAY(IF(E80=0,\"\",E80),1),\"dddd\"))","v":"sobota"},{"$f":"IF(E80=\"\",\"\",WEEKNUM(IF(E80=0,\"\",E80),1))","v":6},{"$f":"IF(E80=\"\",\"\",TEXT(IF(E80=0,\"\",MONTH(E80))*30,\"mmmm\"))","v":"luty"},{"$f":"YEAR(Tabela2[[#This Row],[Data]])","v":2018},"2018-02-10","I",4054,4404,15,20.234997422540246,1.1489998281693496,13.655378609332047,0.91035857395546982,4.1266666666666669,0.24232633279483037,15,3.8687499999999999,0.25848142164781907,16,{"$f":"IF(E80=\"\",\"\",I80*60*N80)","v":3714.0000000000005},{"$f":"IF(E80=\"\",\"\",(I80+I80/7.5*0.5)*3600)","v":57600},{"$f":"IF(E80=\"\",\"\",40/1.2)","v":33.333333333333336},{"$f":"IF(B80=\"\",\"\",ISEVEN(B80))","v":true},{"$f":"IF(B80=\"\",\"\",IF(W80=TRUE,IF(F80=\"I\",\"TAK\",\"NIE\"),IF(F80=\"I\",\"NIE\",IF(F80=\"III\",\"NIE\",\"TAK\"))))","v":"TAK"},{"$f":"IF(B80=\"\",\"\",IF(AND(X80=\"NIE\",Z80=\"NIE\"),\"TAK\",\"NIE\"))","v":"NIE"},{"$f":"IF(B80=\"\",\"\",IF(F80=\"III\",\"TAK\",\"NIE\"))","v":"NIE"},{"$f":"IF(E80=\"\",\"\",IF(X80=\"TAK\",\"Zmiana A\",IF(Y80=\"TAK\",\"Zmiana B\",\"Zmiana C\")))","v":"Zmiana A"}]
["poniedziałek",7,"luty",{"$f":"YEAR(Tabela2[[#This Row],[Data]])","v":2018},"2018-02-12","I",5607,5907,37.5,42.830690752876166,1.0621517534100311,37.920689454926638,1.0112183854647103,2.4382222222222221,0.41013488880787458,25,2.2858333333333332,0.43747721472839957,26,{"$f":"IF(E81=\"\",\"\",I81*60*N81)","v":5486},{"$f":"IF(E81=\"\",\"\",(I81+I81/7.5*0.5)*3600)","v":144000},{"$f":"IF(E81=\"\",\"\",40/1.2)","v":33.333333333333336},{"$f":"IF(B81=\"\",\"\",ISEVEN(B81))","v":false},{"$f":"IF(B81=\"\",\"\",IF(W81=TRUE,IF(F81=\"I\",\"TAK\",\"NIE\"),IF(F81=\"I\",\"NIE\",IF(F81=\"III\",\"NIE\",\"TAK\"))))","v":"NIE"},{"$f":"IF(B81=\"\",\"\",IF(AND(X81=\"NIE\",Z81=\"NIE\"),\"TAK\",\"NIE\"))","v":"TAK"},{"$f":"IF(B81=\"\",\"\",IF(F81=\"III\",\"TAK\",\"NIE\"))","v":"NIE"},{"$f":"IF(E81=\"\",\"\",IF(X81=\"TAK\",\"Zmiana A\",IF(Y81=\"TAK\",\"Zmiana B\",\"Zmiana C\")))","v":"Zmiana B"}]
["poniedziałek",7,"luty",{"$f":"YEAR(Tabela2[[#This Row],[Data]])","v":2018},"2018-02-12","II",7518,8368,22.5,19.807622849539012,0.74700545997951162,15.264518971625794,0.67842306540559083,3.8014814814814817,0.26305533904910366,16,3.5638888888888891,0.28059236165237722,17,{"$f":"IF(E82=\"\",\"\",I82*60*N82)","v":5132},{"$f":"IF(E82=\"\",\"\",(I82+I82/7.5*0.5)*3600)","v":86400},{"$f":"IF(E82=\"\",\"\",40/1.2)","v":33.333333333333336},{"$f":"IF(B82=\"\",\"\",ISEVEN(B82))","v":false},{"$f":"IF(B82=\"\",\"\",IF(W82=TRUE,IF(F82=\"I\",\"TAK\",\"NIE\"),IF(F82=\"I\",\"NIE\",IF(F82=\"III\",\"NIE\",\"TAK\"))))","v":"TAK"},{"$f":"IF(B82=\"\",\"\",IF(AND(X82=\"NIE\",Z82=\"NIE\"),\"TAK\",\"NIE\"))","v":"NIE"},{"$f":"IF(B82=\"\",\"\",IF(F82=\"III\",\"TAK\",\"NIE\"))","v":"NIE"},{"$f":"IF(E82=\"\",\"\",IF(X82=\"TAK\",\"Zmiana A\",IF(Y82=\"TAK\",\"Zmiana B\",\"Zmiana C\")))","v":"Zmiana A"}]
["poniedziałek",7,"luty",{"$f":"YEAR(Tabela2[[#This Row],[Data]])","v":2018},"2018-02-12","III",2660,2710,7.5,10.484126984126984,0.99788359788359793,2.8839378715807165,0.38452504954409555,5.3111111111111109,0.18828451882845187,11,4.979166666666667,0.20083682008368201,12,{"$f":"IF(E83=\"\",\"\",I83*60*N83)","v":2390},{"$f":"IF(E83=\"\",\"\",(I83+I83/7.5*0.5)*3600)","v":28800},{"$f":"IF(E83=\"\",\"\",40/1.2)","v":33.333333333333336},{"$f":"IF(B83=\"\",\"\",ISEVEN(B83))","v":false},{"$f":"IF(B83=\"\",\"\",IF(W83=TRUE,IF(F83=\"I\",\"TAK\",\"NIE\"),IF(F83=\"I\",\"NIE\",IF(F83=\"III\",\"NIE\",\"TAK\"))))","v":"NIE"},{"$f":"IF(B83=\"\",\"\",IF(AND(X83=\"NIE\",Z83=\"NIE\"),\"TAK\",\"NIE\"))","v":"NIE"},{"$f":"IF(B83=\"\",\"\",IF(F83=\"III\",\"TAK\",\"NIE\"))","v":"TAK"},{"$f":"IF(E83=\"\",\"\",IF(X83=\"TAK\",\"Zmiana A\",IF(Y83=\"TAK\",\"Zmiana B\",\"Zmiana C\")))","v":"Zmiana C"}]
["wtorek",7,"luty",{"$f":"YEAR(Tabela2[[#This Row],[Data]])","v":2018},"2018-02-13","I",3678,4278,37.5,48.932426981856395,1.2248647195161706,42.056171061143779,1.1214978949638341,2.64,0.37878787878787878,23,2.4750000000000001,0.40404040404040403,24,{"$f":"IF(E84=\"\",\"\",I84*60*N84)","v":5940},{"$f":"IF(E84=\"\",\"\",(I84+I84/7.5*0.5)*3600)","v":144000},{"$f":"IF(E84=\"\",\"\",40/1.2)","v":33.333333333333336},{"$f":"IF(B84=\"\",\"\",ISEVEN(B84))","v":false},{"$f":"IF(B84=\"\",\"\",IF(W84=TRUE,IF(F84=\"I\",\"TAK\",\"NIE\"),IF(F84=\"I\",\"NIE\",IF(F84=\"III\",\"NIE\",\"TAK\"))))","v":"NIE"},{"$f":"IF(B84=\"\",\"\",IF(AND(X84=\"NIE\",Z84=\"NIE\"),\"TAK\",\"NIE\"))","v":"TAK"},{"$f":"IF(B84=\"\",\"\",IF(F84=\"III\",\"TAK\",\"NIE\"))","v":"NIE"},{"$f":"IF(E84=\"\",\"\",IF(X84=\"TAK\",\"Zmiana A\",IF(Y84=\"TAK\",\"Zmiana B\",\"Zmiana C\")))","v":"Zmiana B"}]
["wtorek",7,"luty",{"$f":"YEAR(Tabela2[[#This Row],[Data]])","v":2018},"2018-02-13","II",7005,7555,22.5,22.191254578754577,0.85294464794464786,17.71070228798024,0.78714232391023287,0.95777777777777773,1.0440835266821347,63,0.8979166666666667,1.1136890951276102,67,{"$f":"IF(E85=\"\",\"\",I85*60*N85)","v":1293},{"$f":"IF(E85=\"\",\"\",(I85+I85/7.5*0.5)*3600)","v":86400},{"$f":"IF(E85=\"\",\"\",40/1.2)","v":33.333333333333336},{"$f":"IF(B85=\"\",\"\",ISEVEN(B85))","v":false},{"$f":"IF(B85=\"\",\"\",IF(W85=TRUE,IF(F85=\"I\",\"TAK\",\"NIE\"),IF(F85=\"I\",\"NIE\",IF(F85=\"III\",\"NIE\",\"TAK\"))))","v":"TAK"},{"$f":"IF(B85=\"\",\"\",IF(AND(X85=\"NIE\",Z85=\"NIE\"),\"TAK\",\"NIE\"))","v":"NIE"},{"$f":"IF(B85=\"\",\"\",IF(F85=\"III\",\"TAK\",\"NIE\"))","v":"NIE"},{"$f":"IF(E85=\"\",\"\",IF(X85=\"TAK\",\"Zmiana A\",IF(Y85=\"TAK\",\"Zmiana B\",\"Zmiana C\")))","v":"Zmiana A"}]
[{"$f":"IF(E86=\"\",\"\",TEXT(WEEKDAY(IF(E86=0,\"\",E86),1),\"dddd\"))","v":"wtorek"},{"$f":"IF(E86=\"\",\"\",WEEKNUM(IF(E86=0,\"\",E86),1))","v":7},{"$f":"IF(E86=\"\",\"\",TEXT(IF(E86=0,\"\",MONTH(E86))*30,\"mmmm\"))","v":"luty"},{"$f":"YEAR(Tabela2[[#This Row],[Data]])","v":2018},"2018-02-13","II",7005,7555,22.5,22.191254578754577,0.85294464794464786,17.394829217371765,0.77310352077207845,0.95777777777777773,1.0440835266821347,63,0.8979166666666667,1.1136890951276102,67,{"$f":"IF(E86=\"\",\"\",I86*60*N86)","v":1293},{"$f":"IF(E86=\"\",\"\",(I86+I86/7.5*0.5)*3600)","v":86400},{"$f":"IF(E86=\"\",\"\",40/1.2)","v":33.333333333333336},{"$f":"IF(B86=\"\",\"\",ISEVEN(B86))","v":false},{"$f":"IF(B86=\"\",\"\",IF(W86=TRUE,IF(F86=\"I\",\"TAK\",\"NIE\"),IF(F86=\"I\",\"NIE\",IF(F86=\"III\",\"NIE\",\"TAK\"))))","v":"TAK"},{"$f":"IF(B86=\"\",\"\",IF(AND(X86=\"NIE\",Z86=\"NIE\"),\"TAK\",\"NIE\"))","v":"NIE"},{"$f":"IF(B86=\"\",\"\",IF(F86=\"III\",\"TAK\",\"NIE\"))","v":"NIE"},{"$f":"IF(E86=\"\",\"\",IF(X86=\"TAK\",\"Zmiana A\",IF(Y86=\"TAK\",\"Zmiana B\",\"Zmiana C\")))","v":"Zmiana A"}]
["wtorek",7,"luty",{"$f":"YEAR(Tabela2[[#This Row],[Data]])","v":2018},"2018-02-13","III",2478,2578,7.5,10.492063492063494,0.99894179894179913,4.2477877220302851,0.56637169627070472,5.3155555555555551,0.18812709030100336,11,4.9833333333333334,0.20066889632107024,12,{"$f":"IF(E87=\"\",\"\",I87*60*N87)","v":2392},{"$f":"IF(E87=\"\",\"\",(I87+I87/7.5*0.5)*3600)","v":28800},{"$f":"IF(E87=\"\",\"\",40/1.2)","v":33.333333333333336},{"$f":"IF(B87=\"\",\"\",ISEVEN(B87))","v":false},{"$f":"IF(B87=\"\",\"\",IF(W87=TRUE,IF(F87=\"I\",\"TAK\",\"NIE\"),IF(F87=\"I\",\"NIE\",IF(F87=\"III\",\"NIE\",\"TAK\"))))","v":"NIE"},{"$f":"IF(B87=\"\",\"\",IF(AND(X87=\"NIE\",Z87=\"NIE\"),\"TAK\",\"NIE\"))","v":"NIE"},{"$f":"IF(B87=\"\",\"\",IF(F87=\"III\",\"TAK\",\"NIE\"))","v":"TAK"},{"$f":"IF(E87=\"\",\"\",IF(X87=\"TAK\",\"Zmiana A\",IF(Y87=\"TAK\",\"Zmiana B\",\"Zmiana C\")))","v":"Zmiana C"}]
["środa",7,"luty",{"$f":"YEAR(Tabela2[[#This Row],[Data]])","v":2018},"2018-02-14","I",1145,1295,33.5,45.037485784270842,1.2548503219185325,38.575693586564029,1.1515132413899709,2.9577114427860698,0.3380992430613961,20,2.7523148148148149,0.36333052985702269,22,{"$f":"IF(E88=\"\",\"\",I88*60*N88)","v":5945},{"$f":"IF(E88=\"\",\"\",(I88+I88/7.5*0.5)*3600)","v":128640},{"$f":"IF(E88=\"\",\"\",40/1.2)","v":33.333333333333336},{"$f":"IF(B88=\"\",\"\",ISEVEN(B88))","v":false},{"$f":"IF(B88=\"\",\"\",IF(W88=TRUE,IF(F88=\"I\",\"TAK\",\"NIE\"),IF(F88=\"I\",\"NIE\",IF(F88=\"III\",\"NIE\",\"TAK\"))))","v":"NIE"},{"$f":"IF(B88=\"\",\"\",IF(AND(X88=\"NIE\",Z88=\"NIE\"),\"TAK\",\"NIE\"))","v":"TAK"},{"$f":"IF(B88=\"\",\"\",IF(F88=\"III\",\"TAK\",\"NIE\"))","v":"NIE"},{"$f":"IF(E88=\"\",\"\",IF(X88=\"TAK\",\"Zmiana A\",IF(Y88=\"TAK\",\"Zmiana B\",\"Zmiana C\")))","v":"Zmiana B"}]
["środa",7,"luty",{"$f":"YEAR(Tabela2[[#This Row],[Data]])","v":2018},"2018-02-14","II",7285,7785,17.5,13.276190476190475,0.58721088435374147,9.2167854510530276,0.5266734543458873,0.69523809523809521,1.4383561643835616,86,0.64035087719298245,1.5616438356164384,94,{"$f":"IF(E89=\"\",\"\",I89*60*N89)","v":730},{"$f":"IF(E89=\"\",\"\",(I89+I89/7.5*0.5)*3600)","v":67200},{"$f":"IF(E89=\"\",\"\",40/1.2)","v":33.333333333333336},{"$f":"IF(B89=\"\",\"\",ISEVEN(B89))","v":false},{"$f":"IF(B89=\"\",\"\",IF(W89=TRUE,IF(F89=\"I\",\"TAK\",\"NIE\"),IF(F89=\"I\",\"NIE\",IF(F89=\"III\",\"NIE\",\"TAK\"))))","v":"TAK"},{"$f":"IF(B89=\"\",\"\",IF(AND(X89=\"NIE\",Z89=\"NIE\"),\"TAK\",\"NIE\"))","v":"NIE"},{"$f":"IF(B89=\"\",\"\",IF(F89=\"III\",\"TAK\",\"NIE\"))","v":"NIE"},{"$f":"IF(E89=\"\",\"\",IF(X89=\"TAK\",\"Zmiana A\",IF(Y89=\"TAK\",\"Zmiana B\",\"Zmiana C\")))","v":"Zmiana A"}]
["środa",7,"luty",{"$f":"YEAR(Tabela2[[#This Row],[Data]])","v":2018},"2018-02-14","III",2166,2416,7.5,9.8039468577043305,0.90719291436057736,3.7901689520549233,0.50535586027398982,3.54,0.2824858757062147,17,3.3187500000000001,0.30131826741996232,18,{"$f":"IF(E90=\"\",\"\",I90*60*N90)","v":1593},{"$f":"IF(E90=\"\",\"\",(I90+I90/7.5*0.5)*3600)","v":28800},{"$f":"IF(E90=\"\",\"\",40/1.2)","v":33.333333333333336},{"$f":"IF(B90=\"\",\"\",ISEVEN(B90))","v":false},{"$f":"IF(B90=\"\",\"\",IF(W90=TRUE,IF(F90=\"I\",\"TAK\",\"NIE\"),IF(F90=\"I\",\"NIE\",IF(F90=\"III\",\"NIE\",\"TAK\"))))","v":"NIE"},{"$f":"IF(B90=\"\",\"\",IF(AND(X90=\"NIE\",Z90=\"NIE\"),\"TAK\",\"NIE\"))","v":"NIE"},{"$f":"IF(B90=\"\",\"\",IF(F90=\"III\",\"TAK\",\"NIE\"))","v":"TAK"},{"$f":"IF(E90=\"\",\"\",IF(X90=\"TAK\",\"Zmiana A\",IF(Y90=\"TAK\",\"Zmiana B\",\"Zmiana C\")))","v":"Zmiana C"}]
["czwartek",7,"luty",{"$f":"YEAR(Tabela2[[#This Row],[Data]])","v":2018},"2018-02-15","I",2344,2744,33.5,44.661650139173688,1.2436313474380205,39.10922552340039,1.1674395678626983,1.8930348258706469,0.52825229960578191,32,1.7615740740740742,0.56767411300919846,34,{"$f":"IF(E91=\"\",\"\",I91*60*N91)","v":3805},{"$f":"IF(E91=\"\",\"\",(I91+I91/7.5*0.5)*3600)","v":128640},{"$f":"IF(E91=\"\",\"\",40/1.2)","v":33.333333333333336},{"$f":"IF(B91=\"\",\"\",ISEVEN(B91))","v":false},{"$f":"IF(B91=\"\",\"\",IF(W91=TRUE,IF(F91=\"I\",\"TAK\",\"NIE\"),IF(F91=\"I\",\"NIE\",IF(F91=\"III\",\"NIE\",\"TAK\"))))","v":"NIE"},{"$f":"IF(B91=\"\",\"\",IF(AND(X91=\"NIE\",Z91=\"NIE\"),\"TAK\",\"NIE\"))","v":"TAK"},{"$f":"IF(B91=\"\",\"\",IF(F91=\"III\",\"TAK\",\"NIE\"))","v":"NIE"},{"$f":"IF(E91=\"\",\"\",IF(X91=\"TAK\",\"Zmiana A\",IF(Y91=\"TAK\",\"Zmiana B\",\"Zmiana C\")))","v":"Zmiana B"}]
[{"$f":"IF(E92=\"\",\"\",TEXT(WEEKDAY(IF(E92=0,\"\",E92),1),\"dddd\"))","v":"czwartek"},{"$f":"IF(E92=\"\",\"\",WEEKNUM(IF(E92=0,\"\",E92),1))","v":7},{"$f":"IF(E92=\"\",\"\",TEXT(IF(E92=0,\"\",MONTH(E92))*30,\"mmmm\"))","v":"luty"},{"$f":"YEAR(Tabela2[[#This Row],[Data]])","v":2018},"2018-02-15","II",4865,5415,22.5,20.017097376585042,0.75631543895933517,15.51208881839402,0.68942616970640092,0.96592592592592597,1.0352760736196318,62,0.90555555555555556,1.1042944785276074,66,{"$f":"IF(E92=\"\",\"\",I92*60*N92)","v":1304},{"$f":"IF(E92=\"\",\"\",(I92+I92/7.5*0.5)*3600)","v":86400},{"$f":"IF(E92=\"\",\"\",40/1.2)","v":33.333333333333336},{"$f":"IF(B92=\"\",\"\",ISEVEN(B92))","v":false},{"$f":"IF(B92=\"\",\"\",IF(W92=TRUE,IF(F92=\"I\",\"TAK\",\"NIE\"),IF(F92=\"I\",\"NIE\",IF(F92=\"III\",\"NIE\",\"TAK\"))))","v":"TAK"},{"$f":"IF(B92=\"\",\"\",IF(AND(X92=\"NIE\",Z92=\"NIE\"),\"TAK\",\"NIE\"))","v":"NIE"},{"$f":"IF(B92=\"\",\"\",IF(F92=\"III\",\"TAK\",\"NIE\"))","v":"NIE"},{"$f":"IF(E92=\"\",\"\",IF(X92=\"TAK\",\"Zmiana A\",IF(Y92=\"TAK\",\"Zmiana B\",\"Zmiana C\")))","v":"Zmiana A"}]
[{"$f":"IF(E93=\"\",\"\",TEXT(WEEKDAY(IF(E93=0,\"\",E93),1),\"dddd\"))","v":"piątek"},{"$f":"IF(E93=\"\",\"\",WEEKNUM(IF(E93=0,\"\",E93),1))","v":7},{"$f":"IF(E93=\"\",\"\",TEXT(IF(E93=0,\"\",MONTH(E93))*30,\"mmmm\"))","v":"luty"},{"$f":"YEAR(Tabela2[[#This Row],[Data]])","v":2018},"2018-02-16","I",2996,3646,37.5,35.196436302355806,0.85857163472948816,31.128624140627963,0.83009664375007897,2.133777777777778,0.4686523640908144,28,2.0004166666666667,0.49989585503020206,30,{"$f":"IF(E93=\"\",\"\",I93*60*N93)","v":4801.0000000000009},{"$f":"IF(E93=\"\",\"\",(I93+I93/7.5*0.5)*3600)","v":144000},{"$f":"IF(E93=\"\",\"\",40/1.2)","v":33.333333333333336},{"$f":"IF(B93=\"\",\"\",ISEVEN(B93))","v":false},{"$f":"IF(B93=\"\",\"\",IF(W93=TRUE,IF(F93=\"I\",\"TAK\",\"NIE\"),IF(F93=\"I\",\"NIE\",IF(F93=\"III\",\"NIE\",\"TAK\"))))","v":"NIE"},{"$f":"IF(B93=\"\",\"\",IF(AND(X93=\"NIE\",Z93=\"NIE\"),\"TAK\",\"NIE\"))","v":"TAK"},{"$f":"IF(B93=\"\",\"\",IF(F93=\"III\",\"TAK\",\"NIE\"))","v":"NIE"},{"$f":"IF(E93=\"\",\"\",IF(X93=\"TAK\",\"Zmiana A\",IF(Y93=\"TAK\",\"Zmiana B\",\"Zmiana C\")))","v":"Zmiana B"}]
[{"$f":"IF(E94=\"\",\"\",TEXT(WEEKDAY(IF(E94=0,\"\",E94),1),\"dddd\"))","v":"piątek"},{"$f":"IF(E94=\"\",\"\",WEEKNUM(IF(E94=0,\"\",E94),1))","v":7},{"$f":"IF(E94=\"\",\"\",TEXT(IF(E94=0,\"\",MONTH(E94))*30,\"mmmm\"))","v":"luty"},{"$f":"YEAR(Tabela2[[#This Row],[Data]])","v":2018},"2018-02-16","II",6263,6863,22.5,18.753111865233635,0.70013830512149489,11.529552173906383,0.5124245410625059,1.1444444444444444,0.87378640776699024,52,1.0729166666666667,0.93203883495145634,56,{"$f":"IF(E94=\"\",\"\",I94*60*N94)","v":1545},{"$f":"IF(E94=\"\",\"\",(I94+I94/7.5*0.5)*3600)","v":86400},{"$f":"IF(E94=\"\",\"\",40/1.2)","v":33.333333333333336},{"$f":"IF(B94=\"\",\"\",ISEVEN(B94))","v":false},{"$f":"IF(B94=\"\",\"\",IF(W94=TRUE,IF(F94=\"I\",\"TAK\",\"NIE\"),IF(F94=\"I\",\"NIE\",IF(F94=\"III\",\"NIE\",\"TAK\"))))","v":"TAK"},{"$f":"IF(B94=\"\",\"\",IF(AND(X94=\"NIE\",Z94=\"NIE\"),\"TAK\",\"NIE\"))","v":"NIE"},{"$f":"IF(B94=\"\",\"\",IF(F94=\"III\",\"TAK\",\"NIE\"))","v":"NIE"},{"$f":"IF(E94=\"\",\"\",IF(X94=\"TAK\",\"Zmiana A\",IF(Y94=\"TAK\",\"Zmiana B\",\"Zmiana C\")))","v":"Zmiana A"}]
[{"$f":"IF(E95=\"\",\"\",TEXT(WEEKDAY(IF(E95=0,\"\",E95),1),\"dddd\"))","v":"poniedziałek"},{"$f":"IF(E95=\"\",\"\",WEEKNUM(IF(E95=0,\"\",E95),1))","v":8},{"$f":"IF(E95=\"\",\"\",TEXT(IF(E95=0,\"\",MONTH(E95))*30,\"mmmm\"))","v":"luty"},{"$f":"YEAR(Tabela2[[#This Row],[Data]])","v":2018},"2018-02-19","I",5528,6128,22.5,26.024667356678741,1.0233185491857217,21.520240422742727,0.95645512989967674,3.0022222222222221,0.33308660251665434,20,2.8145833333333332,0.35529237601776464,21,{"$f":"IF(E95=\"\",\"\",I95*60*N95)","v":4053},{"$f":"IF(E95=\"\",\"\",(I95+I95/7.5*0.5)*3600)","v":86400},{"$f":"IF(E95=\"\",\"\",40/1.2)","v":33.333333333333336},{"$f":"IF(B95=\"\",\"\",ISEVEN(B95))","v":true},{"$f":"IF(B95=\"\",\"\",IF(W95=TRUE,IF(F95=\"I\",\"TAK\",\"NIE\"),IF(F95=\"I\",\"NIE\",IF(F95=\"III\",\"NIE\",\"TAK\"))))","v":"TAK"},{"$f":"IF(B95=\"\",\"\",IF(AND(X95=\"NIE\",Z95=\"NIE\"),\"TAK\",\"NIE\"))","v":"NIE"},{"$f":"IF(B95=\"\",\"\",IF(F95=\"III\",\"TAK\",\"NIE\"))","v":"NIE"},{"$f":"IF(E95=\"\",\"\",IF(X95=\"TAK\",\"Zmiana A\",IF(Y95=\"TAK\",\"Zmiana B\",\"Zmiana C\")))","v":"Zmiana A"}]
[{"$f":"IF(E96=\"\",\"\",TEXT(WEEKDAY(IF(E96=0,\"\",E96),1),\"dddd\"))","v":"poniedziałek"},{"$f":"IF(E96=\"\",\"\",WEEKNUM(IF(E96=0,\"\",E96),1))","v":8},{"$f":"IF(E96=\"\",\"\",TEXT(IF(E96=0,\"\",MONTH(E96))*30,\"mmmm\"))","v":"luty"},{"$f":"YEAR(Tabela2[[#This Row],[Data]])","v":2018},"2018-02-19","II",2287,2687,22.5,23.214386067382581,0.89841715855033688,19.019479980130946,0.84531022133915312,1.3474074074074074,0.74216602528862008,45,1.2631944444444445,0.79164376030786143,47,{"$f":"IF(E96=\"\",\"\",I96*60*N96)","v":1819},{"$f":"IF(E96=\"\",\"\",(I96+I96/7.5*0.5)*3600)","v":86400},{"$f":"IF(E96=\"\",\"\",40/1.2)","v":33.333333333333336},{"$f":"IF(B96=\"\",\"\",ISEVEN(B96))","v":true},{"$f":"IF(B96=\"\",\"\",IF(W96=TRUE,IF(F96=\"I\",\"TAK\",\"NIE\"),IF(F96=\"I\",\"NIE\",IF(F96=\"III\",\"NIE\",\"TAK\"))))","v":"NIE"},{"$f":"IF(B96=\"\",\"\",IF(AND(X96=\"NIE\",Z96=\"NIE\"),\"TAK\",\"NIE\"))","v":"TAK"},{"$f":"IF(B96=\"\",\"\",IF(F96=\"III\",\"TAK\",\"NIE\"))","v":"NIE"},{"$f":"IF(E96=\"\",\"\",IF(X96=\"TAK\",\"Zmiana A\",IF(Y96=\"TAK\",\"Zmiana B\",\"Zmiana C\")))","v":"Zmiana B"}]
[{"$f":"IF(E97=\"\",\"\",TEXT(WEEKDAY(IF(E97=0,\"\",E97),1),\"dddd\"))","v":"poniedziałek"},{"$f":"IF(E97=\"\",\"\",WEEKNUM(IF(E97=0,\"\",E97),1))","v":8},{"$f":"IF(E97=\"\",\"\",TEXT(IF(E97=0,\"\",MONTH(E97))*30,\"mmmm\"))","v":"luty"},{"$f":"YEAR(Tabela2[[#This Row],[Data]])","v":2018},"2018-02-19","III",3489,3639,15,20.107936507936508,1.1405291005291005,13.951355553823404,0.93009037025489361,3.2966666666666669,0.30333670374115268,18,3.0906250000000002,0.32355915065722951,19,{"$f":"IF(E97=\"\",\"\",I97*60*N97)","v":2967},{"$f":"IF(E97=\"\",\"\",(I97+I97/7.5*0.5)*3600)","v":57600},{"$f":"IF(E97=\"\",\"\",40/1.2)","v":33.333333333333336},{"$f":"IF(B97=\"\",\"\",ISEVEN(B97))","v":true},{"$f":"IF(B97=\"\",\"\",IF(W97=TRUE,IF(F97=\"I\",\"TAK\",\"NIE\"),IF(F97=\"I\",\"NIE\",IF(F97=\"III\",\"NIE\",\"TAK\"))))","v":"NIE"},{"$f":"IF(B97=\"\",\"\",IF(AND(X97=\"NIE\",Z97=\"NIE\"),\"TAK\",\"NIE\"))","v":"NIE"},{"$f":"IF(B97=\"\",\"\",IF(F97=\"III\",\"TAK\",\"NIE\"))","v":"TAK"},{"$f":"IF(E97=\"\",\"\",IF(X97=\"TAK\",\"Zmiana A\",IF(Y97=\"TAK\",\"Zmiana B\",\"Zmiana C\")))","v":"Zmiana C"}]
["wtorek",8,"luty",{"$f":"YEAR(Tabela2[[#This Row],[Data]])","v":2018},"2018-02-20","I",6194,6844,30,27.405557429203675,0.81351858097345586,20.114133438737987,0.67047111462459952,2.3066666666666666,0.43352601156069365,26,2.1625000000000001,0.46242774566473988,28,{"$f":"IF(E98=\"\",\"\",I98*60*N98)","v":4152},{"$f":"IF(E98=\"\",\"\",(I98+I98/7.5*0.5)*3600)","v":115200},{"$f":"IF(E98=\"\",\"\",40/1.2)","v":33.333333333333336},{"$f":"IF(B98=\"\",\"\",ISEVEN(B98))","v":true},{"$f":"IF(B98=\"\",\"\",IF(W98=TRUE,IF(F98=\"I\",\"TAK\",\"NIE\"),IF(F98=\"I\",\"NIE\",IF(F98=\"III\",\"NIE\",\"TAK\"))))","v":"TAK"},{"$f":"IF(B98=\"\",\"\",IF(AND(X98=\"NIE\",Z98=\"NIE\"),\"TAK\",\"NIE\"))","v":"NIE"},{"$f":"IF(B98=\"\",\"\",IF(F98=\"III\",\"TAK\",\"NIE\"))","v":"NIE"},{"$f":"IF(E98=\"\",\"\",IF(X98=\"TAK\",\"Zmiana A\",IF(Y98=\"TAK\",\"Zmiana B\",\"Zmiana C\")))","v":"Zmiana A"}]
["wtorek",8,"luty",{"$f":"YEAR(Tabela2[[#This Row],[Data]])","v":2018},"2018-02-20","II",1593,1793,13,14.73447619047619,0.90265201465201461,10.376022721277586,0.7981555939444297,1.2192307692307693,0.82018927444794953,49,1.1321428571428571,0.88328075709779175,53,{"$f":"IF(E99=\"\",\"\",I99*60*N99)","v":951.00000000000011},{"$f":"IF(E99=\"\",\"\",(I99+I99/7.5*0.5)*3600)","v":49920},{"$f":"IF(E99=\"\",\"\",40/1.2)","v":33.333333333333336},{"$f":"IF(B99=\"\",\"\",ISEVEN(B99))","v":true},{"$f":"IF(B99=\"\",\"\",IF(W99=TRUE,IF(F99=\"I\",\"TAK\",\"NIE\"),IF(F99=\"I\",\"NIE\",IF(F99=\"III\",\"NIE\",\"TAK\"))))","v":"NIE"},{"$f":"IF(B99=\"\",\"\",IF(AND(X99=\"NIE\",Z99=\"NIE\"),\"TAK\",\"NIE\"))","v":"TAK"},{"$f":"IF(B99=\"\",\"\",IF(F99=\"III\",\"TAK\",\"NIE\"))","v":"NIE"},{"$f":"IF(E99=\"\",\"\",IF(X99=\"TAK\",\"Zmiana A\",IF(Y99=\"TAK\",\"Zmiana B\",\"Zmiana C\")))","v":"Zmiana B"}]
["wtorek",8,"luty",{"$f":"YEAR(Tabela2[[#This Row],[Data]])","v":2018},"2018-02-20","III",3741,3991,15,17.562799150535,0.97085327670233335,11.111159477875932,0.7407439651917288,3.5611111111111109,0.28081123244929795,17,3.3385416666666665,0.29953198127925118,18,{"$f":"IF(E100=\"\",\"\",I100*60*N100)","v":3205},{"$f":"IF(E100=\"\",\"\",(I100+I100/7.5*0.5)*3600)","v":57600},{"$f":"IF(E100=\"\",\"\",40/1.2)","v":33.333333333333336},{"$f":"IF(B100=\"\",\"\",ISEVEN(B100))","v":true},{"$f":"IF(B100=\"\",\"\",IF(W100=TRUE,IF(F100=\"I\",\"TAK\",\"NIE\"),IF(F100=\"I\",\"NIE\",IF(F100=\"III\",\"NIE\",\"TAK\"))))","v":"NIE"},{"$f":"IF(B100=\"\",\"\",IF(AND(X100=\"NIE\",Z100=\"NIE\"),\"TAK\",\"NIE\"))","v":"NIE"},{"$f":"IF(B100=\"\",\"\",IF(F100=\"III\",\"TAK\",\"NIE\"))","v":"TAK"},{"$f":"IF(E100=\"\",\"\",IF(X100=\"TAK\",\"Zmiana A\",IF(Y100=\"TAK\",\"Zmiana B\",\"Zmiana C\")))","v":"Zmiana C"}]
["środa",8,"luty",{"$f":"YEAR(Tabela2[[#This Row],[Data]])","v":2018},"2018-02-21","I",6580,7380,37.5,38.665304647577003,0.95107479060205335,34.201164610301845,0.91203105627471581,2.2422222222222223,0.44598612487611494,27,2.1020833333333333,0.47571853320118929,29,{"$f":"IF(E101=\"\",\"\",I101*60*N101)","v":5045},{"$f":"IF(E101=\"\",\"\",(I101+I101/7.5*0.5)*3600)","v":144000},{"$f":"IF(E101=\"\",\"\",40/1.2)","v":33.333333333333336},{"$f":"IF(B101=\"\",\"\",ISEVEN(B101))","v":true},{"$f":"IF(B101=\"\",\"\",IF(W101=TRUE,IF(F101=\"I\",\"TAK\",\"NIE\"),IF(F101=\"I\",\"NIE\",IF(F101=\"III\",\"NIE\",\"TAK\"))))","v":"TAK"},{"$f":"IF(B101=\"\",\"\",IF(AND(X101=\"NIE\",Z101=\"NIE\"),\"TAK\",\"NIE\"))","v":"NIE"},{"$f":"IF(B101=\"\",\"\",IF(F101=\"III\",\"TAK\",\"NIE\"))","v":"NIE"},{"$f":"IF(E101=\"\",\"\",IF(X101=\"TAK\",\"Zmiana A\",IF(Y101=\"TAK\",\"Zmiana B\",\"Zmiana C\")))","v":"Zmiana A"}]
["środa",8,"luty",{"$f":"YEAR(Tabela2[[#This Row],[Data]])","v":2018},"2018-02-21","III",7313,7713,15,17.562799150535,0.97085327670233335,12.573261056685002,0.83821740377900011,3.5611111111111109,0.28081123244929795,17,3.3385416666666665,0.29953198127925118,18,{"$f":"IF(E102=\"\",\"\",I102*60*N102)","v":3205},{"$f":"IF(E102=\"\",\"\",(I102+I102/7.5*0.5)*3600)","v":57600},{"$f":"IF(E102=\"\",\"\",40/1.2)","v":33.333333333333336},{"$f":"IF(B102=\"\",\"\",ISEVEN(B102))","v":true},{"$f":"IF(B102=\"\",\"\",IF(W102=TRUE,IF(F102=\"I\",\"TAK\",\"NIE\"),IF(F102=\"I\",\"NIE\",IF(F102=\"III\",\"NIE\",\"TAK\"))))","v":"NIE"},{"$f":"IF(B102=\"\",\"\",IF(AND(X102=\"NIE\",Z102=\"NIE\"),\"TAK\",\"NIE\"))","v":"NIE"},{"$f":"IF(B102=\"\",\"\",IF(F102=\"III\",\"TAK\",\"NIE\"))","v":"TAK"},{"$f":"IF(E102=\"\",\"\",IF(X102=\"TAK\",\"Zmiana A\",IF(Y102=\"TAK\",\"Zmiana B\",\"Zmiana C\")))","v":"Zmiana C"}]
[{"$f":"IF(E103=\"\",\"\",TEXT(WEEKDAY(IF(E103=0,\"\",E103),1),\"dddd\"))","v":"środa"},{"$f":"IF(E103=\"\",\"\",WEEKNUM(IF(E103=0,\"\",E103),1))","v":8},{"$f":"IF(E103=\"\",\"\",TEXT(IF(E103=0,\"\",MONTH(E103))*30,\"mmmm\"))","v":"luty"},{"$f":"YEAR(Tabela2[[#This Row],[Data]])","v":2018},"2018-02-21","III",7313,7713,15,18.697930574098798,1.0465287049399199,12.360369376436598,0.82402462509577323,3.2177777777777776,0.31077348066298344,19,3.0166666666666666,0.33149171270718231,20,{"$f":"IF(E103=\"\",\"\",I103*60*N103)","v":2896},{"$f":"IF(E103=\"\",\"\",(I103+I103/7.5*0.5)*3600)","v":57600},{"$f":"IF(E103=\"\",\"\",40/1.2)","v":33.333333333333336},{"$f":"IF(B103=\"\",\"\",ISEVEN(B103))","v":true},{"$f":"IF(B103=\"\",\"\",IF(W103=TRUE,IF(F103=\"I\",\"TAK\",\"NIE\"),IF(F103=\"I\",\"NIE\",IF(F103=\"III\",\"NIE\",\"TAK\"))))","v":"NIE"},{"$f":"IF(B103=\"\",\"\",IF(AND(X103=\"NIE\",Z103=\"NIE\"),\"TAK\",\"NIE\"))","v":"NIE"},{"$f":"IF(B103=\"\",\"\",IF(F103=\"III\",\"TAK\",\"NIE\"))","v":"TAK"},{"$f":"IF(E103=\"\",\"\",IF(X103=\"TAK\",\"Zmiana A\",IF(Y103=\"TAK\",\"Zmiana B\",\"Zmiana C\")))","v":"Zmiana C"}]
["czwartek",8,"luty",{"$f":"YEAR(Tabela2[[#This Row],[Data]])","v":2018},"2018-02-22","II",1285,1585,7.5,7.7315564084534554,0.63087418779379401,3.3042317537626422,0.44056423383501897,1.2844444444444445,0.77854671280276821,47,1.2041666666666666,0.83044982698961933,50,{"$f":"IF(E104=\"\",\"\",I104*60*N104)","v":578},{"$f":"IF(E104=\"\",\"\",(I104+I104/7.5*0.5)*3600)","v":28800},{"$f":"IF(E104=\"\",\"\",40/1.2)","v":33.333333333333336},{"$f":"IF(B104=\"\",\"\",ISEVEN(B104))","v":true},{"$f":"IF(B104=\"\",\"\",IF(W104=TRUE,IF(F104=\"I\",\"TAK\",\"NIE\"),IF(F104=\"I\",\"NIE\",IF(F104=\"III\",\"NIE\",\"TAK\"))))","v":"NIE"},{"$f":"IF(B104=\"\",\"\",IF(AND(X104=\"NIE\",Z104=\"NIE\"),\"TAK\",\"NIE\"))","v":"TAK"},{"$f":"IF(B104=\"\",\"\",IF(F104=\"III\",\"TAK\",\"NIE\"))","v":"NIE"},{"$f":"IF(E104=\"\",\"\",IF(X104=\"TAK\",\"Zmiana A\",IF(Y104=\"TAK\",\"Zmiana B\",\"Zmiana C\")))","v":"Zmiana B"}]
["czwartek",8,"luty",{"$f":"YEAR(Tabela2[[#This Row],[Data]])","v":2018},"2018-02-22","III",2991,3241,15,19.684390630950009,1.1122927087300005,15.316195596811479,1.0210797064540986,3.0422222222222222,0.3287070854638422,20,2.8520833333333333,0.35062089116143169,21,{"$f":"IF(E105=\"\",\"\",I105*60*N105)","v":2738},{"$f":"IF(E105=\"\",\"\",(I105+I105/7.5*0.5)*3600)","v":57600},{"$f":"IF(E105=\"\",\"\",40/1.2)","v":33.333333333333336},{"$f":"IF(B105=\"\",\"\",ISEVEN(B105))","v":true},{"$f":"IF(B105=\"\",\"\",IF(W105=TRUE,IF(F105=\"I\",\"TAK\",\"NIE\"),IF(F105=\"I\",\"NIE\",IF(F105=\"III\",\"NIE\",\"TAK\"))))","v":"NIE"},{"$f":"IF(B105=\"\",\"\",IF(AND(X105=\"NIE\",Z105=\"NIE\"),\"TAK\",\"NIE\"))","v":"NIE"},{"$f":"IF(B105=\"\",\"\",IF(F105=\"III\",\"TAK\",\"NIE\"))","v":"TAK"},{"$f":"IF(E105=\"\",\"\",IF(X105=\"TAK\",\"Zmiana A\",IF(Y105=\"TAK\",\"Zmiana B\",\"Zmiana C\")))","v":"Zmiana C"}]
["piątek",8,"luty",{"$f":"YEAR(Tabela2[[#This Row],[Data]])","v":2018},"2018-02-23","I",13187,14487,45,43.119469273816996,0.89154376164037774,36.680086841755596,0.81511304092790215,1.9751851851851852,0.50628164260266262,30,1.851736111111111,0.54003375210950688,32,{"$f":"IF(E106=\"\",\"\",I106*60*N106)","v":5333},{"$f":"IF(E106=\"\",\"\",(I106+I106/7.5*0.5)*3600)","v":172800},{"$f":"IF(E106=\"\",\"\",40/1.2)","v":33.333333333333336},{"$f":"IF(B106=\"\",\"\",ISEVEN(B106))","v":true},{"$f":"IF(B106=\"\",\"\",IF(W106=TRUE,IF(F106=\"I\",\"TAK\",\"NIE\"),IF(F106=\"I\",\"NIE\",IF(F106=\"III\",\"NIE\",\"TAK\"))))","v":"TAK"},{"$f":"IF(B106=\"\",\"\",IF(AND(X106=\"NIE\",Z106=\"NIE\"),\"TAK\",\"NIE\"))","v":"NIE"},{"$f":"IF(B106=\"\",\"\",IF(F106=\"III\",\"TAK\",\"NIE\"))","v":"NIE"},{"$f":"IF(E106=\"\",\"\",IF(X106=\"TAK\",\"Zmiana A\",IF(Y106=\"TAK\",\"Zmiana B\",\"Zmiana C\")))","v":"Zmiana A"}]
["piątek",8,"luty",{"$f":"YEAR(Tabela2[[#This Row],[Data]])","v":2018},"2018-02-23","I",13187,14487,45,43.119469273816996,0.89154376164037774,39.06030138241551,0.86800669738701131,1.9751851851851852,0.50628164260266262,30,1.851736111111111,0.54003375210950688,32,{"$f":"IF(E107=\"\",\"\",I107*60*N107)","v":5333},{"$f":"IF(E107=\"\",\"\",(I107+I107/7.5*0.5)*3600)","v":172800},{"$f":"IF(E107=\"\",\"\",40/1.2)","v":33.333333333333336},{"$f":"IF(B107=\"\",\"\",ISEVEN(B107))","v":true},{"$f":"IF(B107=\"\",\"\",IF(W107=TRUE,IF(F107=\"I\",\"TAK\",\"NIE\"),IF(F107=\"I\",\"NIE\",IF(F107=\"III\",\"NIE\",\"TAK\"))))","v":"TAK"},{"$f":"IF(B107=\"\",\"\",IF(AND(X107=\"NIE\",Z107=\"NIE\"),\"TAK\",\"NIE\"))","v":"NIE"},{"$f":"IF(B107=\"\",\"\",IF(F107=\"III\",\"TAK\",\"NIE\"))","v":"NIE"},{"$f":"IF(E107=\"\",\"\",IF(X107=\"TAK\",\"Zmiana A\",IF(Y107=\"TAK\",\"Zmiana B\",\"Zmiana C\")))","v":"Zmiana A"}]
["piątek",8,"luty",{"$f":"YEAR(Tabela2[[#This Row],[Data]])","v":2018},"2018-02-23","III",3712,4062,15,18.591287341950139,1.0394191561300092,13.190604489848166,0.87937363265654445,3.0744444444444445,0.32526201662450305,20,2.8822916666666667,0.34694615106613663,21,{"$f":"IF(E108=\"\",\"\",I108*60*N108)","v":2767},{"$f":"IF(E108=\"\",\"\",(I108+I108/7.5*0.5)*3600)","v":57600},{"$f":"IF(E108=\"\",\"\",40/1.2)","v":33.333333333333336},{"$f":"IF(B108=\"\",\"\",ISEVEN(B108))","v":true},{"$f":"IF(B108=\"\",\"\",IF(W108=TRUE,IF(F108=\"I\",\"TAK\",\"NIE\"),IF(F108=\"I\",\"NIE\",IF(F108=\"III\",\"NIE\",\"TAK\"))))","v":"NIE"},{"$f":"IF(B108=\"\",\"\",IF(AND(X108=\"NIE\",Z108=\"NIE\"),\"TAK\",\"NIE\"))","v":"NIE"},{"$f":"IF(B108=\"\",\"\",IF(F108=\"III\",\"TAK\",\"NIE\"))","v":"TAK"},{"$f":"IF(E108=\"\",\"\",IF(X108=\"TAK\",\"Zmiana A\",IF(Y108=\"TAK\",\"Zmiana B\",\"Zmiana C\")))","v":"Zmiana C"}]
[{"$f":"IF(E109=\"\",\"\",TEXT(WEEKDAY(IF(E109=0,\"\",E109),1),\"dddd\"))","v":"sobota"},{"$f":"IF(E109=\"\",\"\",WEEKNUM(IF(E109=0,\"\",E109),1))","v":8},{"$f":"IF(E109=\"\",\"\",TEXT(IF(E109=0,\"\",MONTH(E109))*30,\"mmmm\"))","v":"luty"},{"$f":"YEAR(Tabela2[[#This Row],[Data]])","v":2018},"2018-02-24","I",1346,1546,7.5,8.7338571428571434,0.7645142857142857,2.2369600085724866,0.29826133447633152,1.7244444444444444,0.57989690721649489,35,1.4370370370370371,0.69587628865979378,42,{"$f":"IF(E109=\"\",\"\",I109*60*N109)","v":776},{"$f":"IF(E109=\"\",\"\",(I109+I109/7.5*0.5)*3600)","v":28800},{"$f":"IF(E109=\"\",\"\",40/1.2)","v":33.333333333333336},{"$f":"IF(B109=\"\",\"\",ISEVEN(B109))","v":true},{"$f":"IF(B109=\"\",\"\",IF(W109=TRUE,IF(F109=\"I\",\"TAK\",\"NIE\"),IF(F109=\"I\",\"NIE\",IF(F109=\"III\",\"NIE\",\"TAK\"))))","v":"TAK"},{"$f":"IF(B109=\"\",\"\",IF(AND(X109=\"NIE\",Z109=\"NIE\"),\"TAK\",\"NIE\"))","v":"NIE"},{"$f":"IF(B109=\"\",\"\",IF(F109=\"III\",\"TAK\",\"NIE\"))","v":"NIE"},{"$f":"IF(E109=\"\",\"\",IF(X109=\"TAK\",\"Zmiana A\",IF(Y109=\"TAK\",\"Zmiana B\",\"Zmiana C\")))","v":"Zmiana A"}]
["poniedziałek",9,"luty",{"$f":"YEAR(Tabela2[[#This Row],[Data]])","v":2018},"2018-02-26","I",1668,1968,37.5,50.612962882956545,1.2696790102121744,44.574198103697093,1.1886452827652558,2.2799999999999998,0.43859649122807015,26,2.1375000000000002,0.46783625730994149,28,{"$f":"IF(E110=\"\",\"\",I110*60*N110)","v":5130},{"$f":"IF(E110=\"\",\"\",(I110+I110/7.5*0.5)*3600)","v":144000},{"$f":"IF(E110=\"\",\"\",40/1.2)","v":33.333333333333336},{"$f":"IF(B110=\"\",\"\",ISEVEN(B110))","v":false},{"$f":"IF(B110=\"\",\"\",IF(W110=TRUE,IF(F110=\"I\",\"TAK\",\"NIE\"),IF(F110=\"I\",\"NIE\",IF(F110=\"III\",\"NIE\",\"TAK\"))))","v":"NIE"},{"$f":"IF(B110=\"\",\"\",IF(AND(X110=\"NIE\",Z110=\"NIE\"),\"TAK\",\"NIE\"))","v":"TAK"},{"$f":"IF(B110=\"\",\"\",IF(F110=\"III\",\"TAK\",\"NIE\"))","v":"NIE"},{"$f":"IF(E110=\"\",\"\",IF(X110=\"TAK\",\"Zmiana A\",IF(Y110=\"TAK\",\"Zmiana B\",\"Zmiana C\")))","v":"Zmiana B"}]
["poniedziałek",9,"luty",{"$f":"YEAR(Tabela2[[#This Row],[Data]])","v":2018},"2018-02-26","II",13681,15381,15,10.734612358530534,0.51564082390203558,3.6637507922552288,0.24425005281701526,1.0933333333333333,0.91463414634146345,55,1.0249999999999999,0.97560975609756095,59,{"$f":"IF(E111=\"\",\"\",I111*60*N111)","v":983.99999999999989},{"$f":"IF(E111=\"\",\"\",(I111+I111/7.5*0.5)*3600)","v":57600},{"$f":"IF(E111=\"\",\"\",40/1.2)","v":33.333333333333336},{"$f":"IF(B111=\"\",\"\",ISEVEN(B111))","v":false},{"$f":"IF(B111=\"\",\"\",IF(W111=TRUE,IF(F111=\"I\",\"TAK\",\"NIE\"),IF(F111=\"I\",\"NIE\",IF(F111=\"III\",\"NIE\",\"TAK\"))))","v":"TAK"},{"$f":"IF(B111=\"\",\"\",IF(AND(X111=\"NIE\",Z111=\"NIE\"),\"TAK\",\"NIE\"))","v":"NIE"},{"$f":"IF(B111=\"\",\"\",IF(F111=\"III\",\"TAK\",\"NIE\"))","v":"NIE"},{"$f":"IF(E111=\"\",\"\",IF(X111=\"TAK\",\"Zmiana A\",IF(Y111=\"TAK\",\"Zmiana B\",\"Zmiana C\")))","v":"Zmiana A"}]
["poniedziałek",9,"luty",{"$f":"YEAR(Tabela2[[#This Row],[Data]])","v":2018},"2018-02-26","I",1668,1968,37.5,50.612962882956545,1.2696790102121744,43.309112757443906,1.1549096735318374,2.2799999999999998,0.43859649122807015,26,2.1375000000000002,0.46783625730994149,28,{"$f":"IF(E112=\"\",\"\",I112*60*N112)","v":5130},{"$f":"IF(E112=\"\",\"\",(I112+I112/7.5*0.5)*3600)","v":144000},{"$f":"IF(E112=\"\",\"\",40/1.2)","v":33.333333333333336},{"$f":"IF(B112=\"\",\"\",ISEVEN(B112))","v":false},{"$f":"IF(B112=\"\",\"\",IF(W112=TRUE,IF(F112=\"I\",\"TAK\",\"NIE\"),IF(F112=\"I\",\"NIE\",IF(F112=\"III\",\"NIE\",\"TAK\"))))","v":"NIE"},{"$f":"IF(B112=\"\",\"\",IF(AND(X112=\"NIE\",Z112=\"NIE\"),\"TAK\",\"NIE\"))","v":"TAK"},{"$f":"IF(B112=\"\",\"\",IF(F112=\"III\",\"TAK\",\"NIE\"))","v":"NIE"},{"$f":"IF(E112=\"\",\"\",IF(X112=\"TAK\",\"Zmiana A\",IF(Y112=\"TAK\",\"Zmiana B\",\"Zmiana C\")))","v":"Zmiana B"}]
["poniedziałek",9,"luty",{"$f":"YEAR(Tabela2[[#This Row],[Data]])","v":2018},"2018-02-26","III",3615,3865,22.5,21.908333333333335,0.84037037037037043,15.504332708733187,0.689081453721475,2.3362962962962963,0.42802790107799621,26,2.1902777777777778,0.45656309448319593,27,{"$f":"IF(E113=\"\",\"\",I113*60*N113)","v":3154},{"$f":"IF(E113=\"\",\"\",(I113+I113/7.5*0.5)*3600)","v":86400},{"$f":"IF(E113=\"\",\"\",40/1.2)","v":33.333333333333336},{"$f":"IF(B113=\"\",\"\",ISEVEN(B113))","v":false},{"$f":"IF(B113=\"\",\"\",IF(W113=TRUE,IF(F113=\"I\",\"TAK\",\"NIE\"),IF(F113=\"I\",\"NIE\",IF(F113=\"III\",\"NIE\",\"TAK\"))))","v":"NIE"},{"$f":"IF(B113=\"\",\"\",IF(AND(X113=\"NIE\",Z113=\"NIE\"),\"TAK\",\"NIE\"))","v":"NIE"},{"$f":"IF(B113=\"\",\"\",IF(F113=\"III\",\"TAK\",\"NIE\"))","v":"TAK"},{"$f":"IF(E113=\"\",\"\",IF(X113=\"TAK\",\"Zmiana A\",IF(Y113=\"TAK\",\"Zmiana B\",\"Zmiana C\")))","v":"Zmiana C"}]
["wtorek",9,"luty",{"$f":"YEAR(Tabela2[[#This Row],[Data]])","v":2018},"2018-02-27","I",1660,1960,30,30.918055583542063,0.93060185278473539,23.031519996649941,0.76771733322166469,2.451111111111111,0.40797824116047143,24,2.2979166666666666,0.43517679057116954,26,{"$f":"IF(E114=\"\",\"\",I114*60*N114)","v":4412},{"$f":"IF(E114=\"\",\"\",(I114+I114/7.5*0.5)*3600)","v":115200},{"$f":"IF(E114=\"\",\"\",40/1.2)","v":33.333333333333336},{"$f":"IF(B114=\"\",\"\",ISEVEN(B114))","v":false},{"$f":"IF(B114=\"\",\"\",IF(W114=TRUE,IF(F114=\"I\",\"TAK\",\"NIE\"),IF(F114=\"I\",\"NIE\",IF(F114=\"III\",\"NIE\",\"TAK\"))))","v":"NIE"},{"$f":"IF(B114=\"\",\"\",IF(AND(X114=\"NIE\",Z114=\"NIE\"),\"TAK\",\"NIE\"))","v":"TAK"},{"$f":"IF(B114=\"\",\"\",IF(F114=\"III\",\"TAK\",\"NIE\"))","v":"NIE"},{"$f":"IF(E114=\"\",\"\",IF(X114=\"TAK\",\"Zmiana A\",IF(Y114=\"TAK\",\"Zmiana B\",\"Zmiana C\")))","v":"Zmiana B"}]
[{"$f":"IF(E115=\"\",\"\",TEXT(WEEKDAY(IF(E115=0,\"\",E115),1),\"dddd\"))","v":"wtorek"},{"$f":"IF(E115=\"\",\"\",WEEKNUM(IF(E115=0,\"\",E115),1))","v":9},{"$f":"IF(E115=\"\",\"\",TEXT(IF(E115=0,\"\",MONTH(E115))*30,\"mmmm\"))","v":"luty"},{"$f":"YEAR(Tabela2[[#This Row],[Data]])","v":2018},"2018-02-27","II",12677,14227,15,8.3098822324628774,0.3539921488308585,1.5618160242752666,0.10412106828501777,1.0355555555555556,0.96566523605150212,58,0.97083333333333333,1.0300429184549356,62,{"$f":"IF(E115=\"\",\"\",I115*60*N115)","v":932},{"$f":"IF(E115=\"\",\"\",(I115+I115/7.5*0.5)*3600)","v":57600},{"$f":"IF(E115=\"\",\"\",40/1.2)","v":33.333333333333336},{"$f":"IF(B115=\"\",\"\",ISEVEN(B115))","v":false},{"$f":"IF(B115=\"\",\"\",IF(W115=TRUE,IF(F115=\"I\",\"TAK\",\"NIE\"),IF(F115=\"I\",\"NIE\",IF(F115=\"III\",\"NIE\",\"TAK\"))))","v":"TAK"},{"$f":"IF(B115=\"\",\"\",IF(AND(X115=\"NIE\",Z115=\"NIE\"),\"TAK\",\"NIE\"))","v":"NIE"},{"$f":"IF(B115=\"\",\"\",IF(F115=\"III\",\"TAK\",\"NIE\"))","v":"NIE"},{"$f":"IF(E115=\"\",\"\",IF(X115=\"TAK\",\"Zmiana A\",IF(Y115=\"TAK\",\"Zmiana B\",\"Zmiana C\")))","v":"Zmiana A"}]
["wtorek",9,"luty",{"$f":"YEAR(Tabela2[[#This Row],[Data]])","v":2018},"2018-02-27","I",1660,1960,37.5,50.612962882956545,1.2696790102121744,43.275965369693388,1.1540257431918237,2.2799999999999998,0.43859649122807015,26,2.1375000000000002,0.46783625730994149,28,{"$f":"IF(E116=\"\",\"\",I116*60*N116)","v":5130},{"$f":"IF(E116=\"\",\"\",(I116+I116/7.5*0.5)*3600)","v":144000},{"$f":"IF(E116=\"\",\"\",40/1.2)","v":33.333333333333336},{"$f":"IF(B116=\"\",\"\",ISEVEN(B116))","v":false},{"$f":"IF(B116=\"\",\"\",IF(W116=TRUE,IF(F116=\"I\",\"TAK\",\"NIE\"),IF(F116=\"I\",\"NIE\",IF(F116=\"III\",\"NIE\",\"TAK\"))))","v":"NIE"},{"$f":"IF(B116=\"\",\"\",IF(AND(X116=\"NIE\",Z116=\"NIE\"),\"TAK\",\"NIE\"))","v":"TAK"},{"$f":"IF(B116=\"\",\"\",IF(F116=\"III\",\"TAK\",\"NIE\"))","v":"NIE"},{"$f":"IF(E116=\"\",\"\",IF(X116=\"TAK\",\"Zmiana A\",IF(Y116=\"TAK\",\"Zmiana B\",\"Zmiana C\")))","v":"Zmiana B"}]
["wtorek",9,"luty",{"$f":"YEAR(Tabela2[[#This Row],[Data]])","v":2018},"2018-02-27","III",3428,3728,22.5,24.709628851540611,0.96487239340180497,19.394085362880858,0.86195934946137143,2.3096296296296295,0.43296985246953174,26,2.1652777777777779,0.46183450930083386,28,{"$f":"IF(E117=\"\",\"\",I117*60*N117)","v":3118},{"$f":"IF(E117=\"\",\"\",(I117+I117/7.5*0.5)*3600)","v":86400},{"$f":"IF(E117=\"\",\"\",40/1.2)","v":33.333333333333336},{"$f":"IF(B117=\"\",\"\",ISEVEN(B117))","v":false},{"$f":"IF(B117=\"\",\"\",IF(W117=TRUE,IF(F117=\"I\",\"TAK\",\"NIE\"),IF(F117=\"I\",\"NIE\",IF(F117=\"III\",\"NIE\",\"TAK\"))))","v":"NIE"},{"$f":"IF(B117=\"\",\"\",IF(AND(X117=\"NIE\",Z117=\"NIE\"),\"TAK\",\"NIE\"))","v":"NIE"},{"$f":"IF(B117=\"\",\"\",IF(F117=\"III\",\"TAK\",\"NIE\"))","v":"TAK"},{"$f":"IF(E117=\"\",\"\",IF(X117=\"TAK\",\"Zmiana A\",IF(Y117=\"TAK\",\"Zmiana B\",\"Zmiana C\")))","v":"Zmiana C"}]
["środa",9,"luty",{"$f":"YEAR(Tabela2[[#This Row],[Data]])","v":2018},"2018-02-28","I",1352,1602,37.5,50.612962882956545,1.2696790102121744,46.425148366902683,1.2380039564507381,2.2799999999999998,0.43859649122807015,26,2.1375000000000002,0.46783625730994149,28,{"$f":"IF(E118=\"\",\"\",I118*60*N118)","v":5130},{"$f":"IF(E118=\"\",\"\",(I118+I118/7.5*0.5)*3600)","v":144000},{"$f":"IF(E118=\"\",\"\",40/1.2)","v":33.333333333333336},{"$f":"IF(B118=\"\",\"\",ISEVEN(B118))","v":false},{"$f":"IF(B118=\"\",\"\",IF(W118=TRUE,IF(F118=\"I\",\"TAK\",\"NIE\"),IF(F118=\"I\",\"NIE\",IF(F118=\"III\",\"NIE\",\"TAK\"))))","v":"NIE"},{"$f":"IF(B118=\"\",\"\",IF(AND(X118=\"NIE\",Z118=\"NIE\"),\"TAK\",\"NIE\"))","v":"TAK"},{"$f":"IF(B118=\"\",\"\",IF(F118=\"III\",\"TAK\",\"NIE\"))","v":"NIE"},{"$f":"IF(E118=\"\",\"\",IF(X118=\"TAK\",\"Zmiana A\",IF(Y118=\"TAK\",\"Zmiana B\",\"Zmiana C\")))","v":"Zmiana B"}]
["środa",9,"luty",{"$f":"YEAR(Tabela2[[#This Row],[Data]])","v":2018},"2018-02-28","II",13253,14953,15,11.429523809523809,0.56196825396825401,4.8336844287375307,0.32224562858250205,0.79666666666666663,1.2552301255230125,75,0.74687499999999996,1.3389121338912133,80,{"$f":"IF(E119=\"\",\"\",I119*60*N119)","v":717},{"$f":"IF(E119=\"\",\"\",(I119+I119/7.5*0.5)*3600)","v":57600},{"$f":"IF(E119=\"\",\"\",40/1.2)","v":33.333333333333336},{"$f":"IF(B119=\"\",\"\",ISEVEN(B119))","v":false},{"$f":"IF(B119=\"\",\"\",IF(W119=TRUE,IF(F119=\"I\",\"TAK\",\"NIE\"),IF(F119=\"I\",\"NIE\",IF(F119=\"III\",\"NIE\",\"TAK\"))))","v":"TAK"},{"$f":"IF(B119=\"\",\"\",IF(AND(X119=\"NIE\",Z119=\"NIE\"),\"TAK\",\"NIE\"))","v":"NIE"},{"$f":"IF(B119=\"\",\"\",IF(F119=\"III\",\"TAK\",\"NIE\"))","v":"NIE"},{"$f":"IF(E119=\"\",\"\",IF(X119=\"TAK\",\"Zmiana A\",IF(Y119=\"TAK\",\"Zmiana B\",\"Zmiana C\")))","v":"Zmiana A"}]
["środa",9,"luty",{"$f":"YEAR(Tabela2[[#This Row],[Data]])","v":2018},"2018-02-28","I",1352,1602,37.5,50.612962882956545,1.2696790102121744,46.209473685359114,1.2322526316095763,2.2799999999999998,0.43859649122807015,26,2.1375000000000002,0.46783625730994149,28,{"$f":"IF(E120=\"\",\"\",I120*60*N120)","v":5130},{"$f":"IF(E120=\"\",\"\",(I120+I120/7.5*0.5)*3600)","v":144000},{"$f":"IF(E120=\"\",\"\",40/1.2)","v":33.333333333333336},{"$f":"IF(B120=\"\",\"\",ISEVEN(B120))","v":false},{"$f":"IF(B120=\"\",\"\",IF(W120=TRUE,IF(F120=\"I\",\"TAK\",\"NIE\"),IF(F120=\"I\",\"NIE\",IF(F120=\"III\",\"NIE\",\"TAK\"))))","v":"NIE"},{"$f":"IF(B120=\"\",\"\",IF(AND(X120=\"NIE\",Z120=\"NIE\"),\"TAK\",\"NIE\"))","v":"TAK"},{"$f":"IF(B120=\"\",\"\",IF(F120=\"III\",\"TAK\",\"NIE\"))","v":"NIE"},{"$f":"IF(E120=\"\",\"\",IF(X120=\"TAK\",\"Zmiana A\",IF(Y120=\"TAK\",\"Zmiana B\",\"Zmiana C\")))","v":"Zmiana B"}]
["środa",9,"luty",{"$f":"YEAR(Tabela2[[#This Row],[Data]])","v":2018},"2018-02-28","III",3968,4218,22.5,23.635576259489305,0.91713672264396906,18.12762030052863,0.80567201335682803,2.3962962962962964,0.41731066460587324,25,2.2465277777777777,0.44513137557959814,27,{"$f":"IF(E121=\"\",\"\",I121*60*N121)","v":3235},{"$f":"IF(E121=\"\",\"\",(I121+I121/7.5*0.5)*3600)","v":86400},{"$f":"IF(E121=\"\",\"\",40/1.2)","v":33.333333333333336},{"$f":"IF(B121=\"\",\"\",ISEVEN(B121))","v":false},{"$f":"IF(B121=\"\",\"\",IF(W121=TRUE,IF(F121=\"I\",\"TAK\",\"NIE\"),IF(F121=\"I\",\"NIE\",IF(F121=\"III\",\"NIE\",\"TAK\"))))","v":"NIE"},{"$f":"IF(B121=\"\",\"\",IF(AND(X121=\"NIE\",Z121=\"NIE\"),\"TAK\",\"NIE\"))","v":"NIE"},{"$f":"IF(B121=\"\",\"\",IF(F121=\"III\",\"TAK\",\"NIE\"))","v":"TAK"},{"$f":"IF(E121=\"\",\"\",IF(X121=\"TAK\",\"Zmiana A\",IF(Y121=\"TAK\",\"Zmiana B\",\"Zmiana C\")))","v":"Zmiana C"}]
[{"$f":"IF(E122=\"\",\"\",TEXT(WEEKDAY(IF(E122=0,\"\",E122),1),\"dddd\"))","v":"czwartek"},{"$f":"IF(E122=\"\",\"\",WEEKNUM(IF(E122=0,\"\",E122),1))","v":9},{"$f":"IF(E122=\"\",\"\",TEXT(IF(E122=0,\"\",MONTH(E122))*30,\"mmmm\"))","v":"marzec"},{"$f":"YEAR(Tabela2[[#This Row],[Data]])","v":2018},"2018-03-01","I",1718,2068,30,34.436955627387597,1.14789852091292,32.53976746354919,1.0846589154516397,2.5261111111111112,0.39586540576204088,24,2.3682291666666666,0.42225643281284364,25,{"$f":"IF(E122=\"\",\"\",I122*60*N122)","v":4547},{"$f":"IF(E122=\"\",\"\",(I122+I122/7.5*0.5)*3600)","v":115200},{"$f":"IF(E122=\"\",\"\",40/1.2)","v":33.333333333333336},{"$f":"IF(B122=\"\",\"\",ISEVEN(B122))","v":false},{"$f":"IF(B122=\"\",\"\",IF(W122=TRUE,IF(F122=\"I\",\"TAK\",\"NIE\"),IF(F122=\"I\",\"NIE\",IF(F122=\"III\",\"NIE\",\"TAK\"))))","v":"NIE"},{"$f":"IF(B122=\"\",\"\",IF(AND(X122=\"NIE\",Z122=\"NIE\"),\"TAK\",\"NIE\"))","v":"TAK"},{"$f":"IF(B122=\"\",\"\",IF(F122=\"III\",\"TAK\",\"NIE\"))","v":"NIE"},{"$f":"IF(E122=\"\",\"\",IF(X122=\"TAK\",\"Zmiana A\",IF(Y122=\"TAK\",\"Zmiana B\",\"Zmiana C\")))","v":"Zmiana B"}]
["czwartek",9,"marzec",{"$f":"YEAR(Tabela2[[#This Row],[Data]])","v":2018},"2018-03-01","II",12440,13890,14,9.4378626059074673,0.67413304327910484,10.572531833025275,0.75518084521609108,1.0214285714285714,0.97902097902097907,59,0.95333333333333337,1.048951048951049,63,{"$f":"IF(E123=\"\",\"\",I123*60*N123)","v":857.99999999999989},{"$f":"IF(E123=\"\",\"\",(I123+I123/7.5*0.5)*3600)","v":53760},{"$f":"IF(E123=\"\",\"\",40/1.2)","v":33.333333333333336},{"$f":"IF(B123=\"\",\"\",ISEVEN(B123))","v":false},{"$f":"IF(B123=\"\",\"\",IF(W123=TRUE,IF(F123=\"I\",\"TAK\",\"NIE\"),IF(F123=\"I\",\"NIE\",IF(F123=\"III\",\"NIE\",\"TAK\"))))","v":"TAK"},{"$f":"IF(B123=\"\",\"\",IF(AND(X123=\"NIE\",Z123=\"NIE\"),\"TAK\",\"NIE\"))","v":"NIE"},{"$f":"IF(B123=\"\",\"\",IF(F123=\"III\",\"TAK\",\"NIE\"))","v":"NIE"},{"$f":"IF(E123=\"\",\"\",IF(X123=\"TAK\",\"Zmiana A\",IF(Y123=\"TAK\",\"Zmiana B\",\"Zmiana C\")))","v":"Zmiana A"}]
["czwartek",9,"marzec",{"$f":"YEAR(Tabela2[[#This Row],[Data]])","v":2018},"2018-03-01","I",1718,2068,37.5,49.612962882956545,1.3230123435455079,51.239004488473732,1.3663734530259661,2.2799999999999998,0.43859649122807015,26,2.1375000000000002,0.46783625730994149,28,{"$f":"IF(E124=\"\",\"\",I124*60*N124)","v":5130},{"$f":"IF(E124=\"\",\"\",(I124+I124/7.5*0.5)*3600)","v":144000},{"$f":"IF(E124=\"\",\"\",40/1.2)","v":33.333333333333336},{"$f":"IF(B124=\"\",\"\",ISEVEN(B124))","v":false},{"$f":"IF(B124=\"\",\"\",IF(W124=TRUE,IF(F124=\"I\",\"TAK\",\"NIE\"),IF(F124=\"I\",\"NIE\",IF(F124=\"III\",\"NIE\",\"TAK\"))))","v":"NIE"},{"$f":"IF(B124=\"\",\"\",IF(AND(X124=\"NIE\",Z124=\"NIE\"),\"TAK\",\"NIE\"))","v":"TAK"},{"$f":"IF(B124=\"\",\"\",IF(F124=\"III\",\"TAK\",\"NIE\"))","v":"NIE"},{"$f":"IF(E124=\"\",\"\",IF(X124=\"TAK\",\"Zmiana A\",IF(Y124=\"TAK\",\"Zmiana B\",\"Zmiana C\")))","v":"Zmiana B"}]
["czwartek",9,"marzec",{"$f":"YEAR(Tabela2[[#This Row],[Data]])","v":2018},"2018-03-01","III",3927,4127,22.5,29.075293305728088,1.2922352580323595,29.922186649214794,1.3298749621873243,2.7666666666666666,0.36144578313253012,22,2.59375,0.38554216867469882,23,{"$f":"IF(E125=\"\",\"\",I125*60*N125)","v":3735},{"$f":"IF(E125=\"\",\"\",(I125+I125/7.5*0.5)*3600)","v":86400},{"$f":"IF(E125=\"\",\"\",40/1.2)","v":33.333333333333336},{"$f":"IF(B125=\"\",\"\",ISEVEN(B125))","v":false},{"$f":"IF(B125=\"\",\"\",IF(W125=TRUE,IF(F125=\"I\",\"TAK\",\"NIE\"),IF(F125=\"I\",\"NIE\",IF(F125=\"III\",\"NIE\",\"TAK\"))))","v":"NIE"},{"$f":"IF(B125=\"\",\"\",IF(AND(X125=\"NIE\",Z125=\"NIE\"),\"TAK\",\"NIE\"))","v":"NIE"},{"$f":"IF(B125=\"\",\"\",IF(F125=\"III\",\"TAK\",\"NIE\"))","v":"TAK"},{"$f":"IF(E125=\"\",\"\",IF(X125=\"TAK\",\"Zmiana A\",IF(Y125=\"TAK\",\"Zmiana B\",\"Zmiana C\")))","v":"Zmiana C"}]
["piątek",9,"marzec",{"$f":"YEAR(Tabela2[[#This Row],[Data]])","v":2018},"2018-03-02","I",5008,5408,22.5,25.610440734852496,1.1382418104378886,23.730232055691314,1.0546769802529472,2.7859259259259259,0.35894708854028184,22,2.6118055555555557,0.3828768944429673,23,{"$f":"IF(E126=\"\",\"\",I126*60*N126)","v":3761},{"$f":"IF(E126=\"\",\"\",(I126+I126/7.5*0.5)*3600)","v":86400},{"$f":"IF(E126=\"\",\"\",40/1.2)","v":33.333333333333336},{"$f":"IF(B126=\"\",\"\",ISEVEN(B126))","v":false},{"$f":"IF(B126=\"\",\"\",IF(W126=TRUE,IF(F126=\"I\",\"TAK\",\"NIE\"),IF(F126=\"I\",\"NIE\",IF(F126=\"III\",\"NIE\",\"TAK\"))))","v":"NIE"},{"$f":"IF(B126=\"\",\"\",IF(AND(X126=\"NIE\",Z126=\"NIE\"),\"TAK\",\"NIE\"))","v":"TAK"},{"$f":"IF(B126=\"\",\"\",IF(F126=\"III\",\"TAK\",\"NIE\"))","v":"NIE"},{"$f":"IF(E126=\"\",\"\",IF(X126=\"TAK\",\"Zmiana A\",IF(Y126=\"TAK\",\"Zmiana B\",\"Zmiana C\")))","v":"Zmiana B"}]
["piątek",9,"marzec",{"$f":"YEAR(Tabela2[[#This Row],[Data]])","v":2018},"2018-03-02","II",5509,6109,15,8.7483436853002079,0.58322291235334722,10.379833542879657,0.69198890285864378,0.69444444444444442,1.44,86,0.65104166666666663,1.536,92,{"$f":"IF(E127=\"\",\"\",I127*60*N127)","v":625},{"$f":"IF(E127=\"\",\"\",(I127+I127/7.5*0.5)*3600)","v":57600},{"$f":"IF(E127=\"\",\"\",40/1.2)","v":33.333333333333336},{"$f":"IF(B127=\"\",\"\",ISEVEN(B127))","v":false},{"$f":"IF(B127=\"\",\"\",IF(W127=TRUE,IF(F127=\"I\",\"TAK\",\"NIE\"),IF(F127=\"I\",\"NIE\",IF(F127=\"III\",\"NIE\",\"TAK\"))))","v":"TAK"},{"$f":"IF(B127=\"\",\"\",IF(AND(X127=\"NIE\",Z127=\"NIE\"),\"TAK\",\"NIE\"))","v":"NIE"},{"$f":"IF(B127=\"\",\"\",IF(F127=\"III\",\"TAK\",\"NIE\"))","v":"NIE"},{"$f":"IF(E127=\"\",\"\",IF(X127=\"TAK\",\"Zmiana A\",IF(Y127=\"TAK\",\"Zmiana B\",\"Zmiana C\")))","v":"Zmiana A"}]
[{"$f":"IF(E128=\"\",\"\",TEXT(WEEKDAY(IF(E128=0,\"\",E128),1),\"dddd\"))","v":"sobota"},{"$f":"IF(E128=\"\",\"\",WEEKNUM(IF(E128=0,\"\",E128),1))","v":9},{"$f":"IF(E128=\"\",\"\",TEXT(IF(E128=0,\"\",MONTH(E128))*30,\"mmmm\"))","v":"marzec"},{"$f":"YEAR(Tabela2[[#This Row],[Data]])","v":2018},"2018-03-03","I",3116,3466,22.5,25.419642857142851,1.1297619047619045,26.35107454835007,1.1711588688155588,1.6777777777777778,0.59602649006622521,36,1.5729166666666667,0.63576158940397354,38,{"$f":"IF(E128=\"\",\"\",I128*60*N128)","v":2265},{"$f":"IF(E128=\"\",\"\",(I128+I128/7.5*0.5)*3600)","v":86400},{"$f":"IF(E128=\"\",\"\",40/1.2)","v":33.333333333333336},{"$f":"IF(B128=\"\",\"\",ISEVEN(B128))","v":false},{"$f":"IF(B128=\"\",\"\",IF(W128=TRUE,IF(F128=\"I\",\"TAK\",\"NIE\"),IF(F128=\"I\",\"NIE\",IF(F128=\"III\",\"NIE\",\"TAK\"))))","v":"NIE"},{"$f":"IF(B128=\"\",\"\",IF(AND(X128=\"NIE\",Z128=\"NIE\"),\"TAK\",\"NIE\"))","v":"TAK"},{"$f":"IF(B128=\"\",\"\",IF(F128=\"III\",\"TAK\",\"NIE\"))","v":"NIE"},{"$f":"IF(E128=\"\",\"\",IF(X128=\"TAK\",\"Zmiana A\",IF(Y128=\"TAK\",\"Zmiana B\",\"Zmiana C\")))","v":"Zmiana B"}]
[{"$f":"IF(E129=\"\",\"\",TEXT(WEEKDAY(IF(E129=0,\"\",E129),1),\"dddd\"))","v":"poniedziałek"},{"$f":"IF(E129=\"\",\"\",WEEKNUM(IF(E129=0,\"\",E129),1))","v":10},{"$f":"IF(E129=\"\",\"\",TEXT(IF(E129=0,\"\",MONTH(E129))*30,\"mmmm\"))","v":"marzec"},{"$f":"YEAR(Tabela2[[#This Row],[Data]])","v":2018},"2018-03-05","I",7842,8842,41,36.479879910354477,0.88975316854523112,37.28465449632553,0.90938181698354947,2.1776422764227643,0.45921224565988428,28,2.0291666666666668,0.49281314168377821,30,{"$f":"IF(E129=\"\",\"\",I129*60*N129)","v":5357},{"$f":"IF(E129=\"\",\"\",(I129+I129/7.5*0.5)*3600)","v":157440},{"$f":"IF(E129=\"\",\"\",40/1.2)","v":33.333333333333336},{"$f":"IF(B129=\"\",\"\",ISEVEN(B129))","v":true},{"$f":"IF(B129=\"\",\"\",IF(W129=TRUE,IF(F129=\"I\",\"TAK\",\"NIE\"),IF(F129=\"I\",\"NIE\",IF(F129=\"III\",\"NIE\",\"TAK\"))))","v":"TAK"},{"$f":"IF(B129=\"\",\"\",IF(AND(X129=\"NIE\",Z129=\"NIE\"),\"TAK\",\"NIE\"))","v":"NIE"},{"$f":"IF(B129=\"\",\"\",IF(F129=\"III\",\"TAK\",\"NIE\"))","v":"NIE"},{"$f":"IF(E129=\"\",\"\",IF(X129=\"TAK\",\"Zmiana A\",IF(Y129=\"TAK\",\"Zmiana B\",\"Zmiana C\")))","v":"Zmiana A"}]
[{"$f":"IF(E130=\"\",\"\",TEXT(WEEKDAY(IF(E130=0,\"\",E130),1),\"dddd\"))","v":"sobota"},{"$f":"IF(E130=\"\",\"\",WEEKNUM(IF(E130=0,\"\",E130),1))","v":9},{"$f":"IF(E130=\"\",\"\",TEXT(IF(E130=0,\"\",MONTH(E130))*30,\"mmmm\"))","v":"marzec"},{"$f":"YEAR(Tabela2[[#This Row],[Data]])","v":2018},"2018-03-03","II",2451,2601,22.5,33.297969690268452,1.4799097640119312,35.184071942314098,1.5637365307695155,1.8081481481481481,0.55305202785743546,33,1.695138888888889,0.58992216304793121,35,{"$f":"IF(E130=\"\",\"\",I130*60*N130)","v":2441},{"$f":"IF(E130=\"\",\"\",(I130+I130/7.5*0.5)*3600)","v":86400},{"$f":"IF(E130=\"\",\"\",40/1.2)","v":33.333333333333336},{"$f":"IF(B130=\"\",\"\",ISEVEN(B130))","v":false},{"$f":"IF(B130=\"\",\"\",IF(W130=TRUE,IF(F130=\"I\",\"TAK\",\"NIE\"),IF(F130=\"I\",\"NIE\",IF(F130=\"III\",\"NIE\",\"TAK\"))))","v":"TAK"},{"$f":"IF(B130=\"\",\"\",IF(AND(X130=\"NIE\",Z130=\"NIE\"),\"TAK\",\"NIE\"))","v":"NIE"},{"$f":"IF(B130=\"\",\"\",IF(F130=\"III\",\"TAK\",\"NIE\"))","v":"NIE"},{"$f":"IF(E130=\"\",\"\",IF(X130=\"TAK\",\"Zmiana A\",IF(Y130=\"TAK\",\"Zmiana B\",\"Zmiana C\")))","v":"Zmiana A"}]
[{"$f":"IF(E131=\"\",\"\",TEXT(WEEKDAY(IF(E131=0,\"\",E131),1),\"dddd\"))","v":"poniedziałek"},{"$f":"IF(E131=\"\",\"\",WEEKNUM(IF(E131=0,\"\",E131),1))","v":10},{"$f":"IF(E131=\"\",\"\",TEXT(IF(E131=0,\"\",MONTH(E131))*30,\"mmmm\"))","v":"marzec"},{"$f":"YEAR(Tabela2[[#This Row],[Data]])","v":2018},"2018-03-05","III",3194,3444,7.5,10.268713774818103,1.3691618366424136,8.5159268167882658,1.1354569089051021,5.5488888888888885,0.18021625951141371,11,5.2020833333333334,0.19223067681217462,12,{"$f":"IF(E131=\"\",\"\",I131*60*N131)","v":2497},{"$f":"IF(E131=\"\",\"\",(I131+I131/7.5*0.5)*3600)","v":28800},{"$f":"IF(E131=\"\",\"\",40/1.2)","v":33.333333333333336},{"$f":"IF(B131=\"\",\"\",ISEVEN(B131))","v":true},{"$f":"IF(B131=\"\",\"\",IF(W131=TRUE,IF(F131=\"I\",\"TAK\",\"NIE\"),IF(F131=\"I\",\"NIE\",IF(F131=\"III\",\"NIE\",\"TAK\"))))","v":"NIE"},{"$f":"IF(B131=\"\",\"\",IF(AND(X131=\"NIE\",Z131=\"NIE\"),\"TAK\",\"NIE\"))","v":"NIE"},{"$f":"IF(B131=\"\",\"\",IF(F131=\"III\",\"TAK\",\"NIE\"))","v":"TAK"},{"$f":"IF(E131=\"\",\"\",IF(X131=\"TAK\",\"Zmiana A\",IF(Y131=\"TAK\",\"Zmiana B\",\"Zmiana C\")))","v":"Zmiana C"}]
[{"$f":"IF(E132=\"\",\"\",TEXT(WEEKDAY(IF(E132=0,\"\",E132),1),\"dddd\"))","v":"wtorek"},{"$f":"IF(E132=\"\",\"\",WEEKNUM(IF(E132=0,\"\",E132),1))","v":10},{"$f":"IF(E132=\"\",\"\",TEXT(IF(E132=0,\"\",MONTH(E132))*30,\"mmmm\"))","v":"marzec"},{"$f":"YEAR(Tabela2[[#This Row],[Data]])","v":2018},"2018-03-06","II",7923,8873,37.5,34.752508091801012,0.92673354911469363,35.171465454782123,0.93790574546085659,2.0293333333333332,0.49277266754270699,30,1.9025000000000001,0.52562417871222078,32,{"$f":"IF(E132=\"\",\"\",I132*60*N132)","v":4566},{"$f":"IF(E132=\"\",\"\",(I132+I132/7.5*0.5)*3600)","v":144000},{"$f":"IF(E132=\"\",\"\",40/1.2)","v":33.333333333333336},{"$f":"IF(B132=\"\",\"\",ISEVEN(B132))","v":true},{"$f":"IF(B132=\"\",\"\",IF(W132=TRUE,IF(F132=\"I\",\"TAK\",\"NIE\"),IF(F132=\"I\",\"NIE\",IF(F132=\"III\",\"NIE\",\"TAK\"))))","v":"NIE"},{"$f":"IF(B132=\"\",\"\",IF(AND(X132=\"NIE\",Z132=\"NIE\"),\"TAK\",\"NIE\"))","v":"TAK"},{"$f":"IF(B132=\"\",\"\",IF(F132=\"III\",\"TAK\",\"NIE\"))","v":"NIE"},{"$f":"IF(E132=\"\",\"\",IF(X132=\"TAK\",\"Zmiana A\",IF(Y132=\"TAK\",\"Zmiana B\",\"Zmiana C\")))","v":"Zmiana B"}]
[{"$f":"IF(E133=\"\",\"\",TEXT(WEEKDAY(IF(E133=0,\"\",E133),1),\"dddd\"))","v":"wtorek"},{"$f":"IF(E133=\"\",\"\",WEEKNUM(IF(E133=0,\"\",E133),1))","v":10},{"$f":"IF(E133=\"\",\"\",TEXT(IF(E133=0,\"\",MONTH(E133))*30,\"mmmm\"))","v":"marzec"},{"$f":"YEAR(Tabela2[[#This Row],[Data]])","v":2018},"2018-03-06","II",7923,8873,22.5,15.632539682539683,0.69477954144620813,15.782330703514891,0.70143692015621739,0.86296296296296293,1.1587982832618027,70,0.80902777777777779,1.2360515021459229,74,{"$f":"IF(E133=\"\",\"\",I133*60*N133)","v":1165},{"$f":"IF(E133=\"\",\"\",(I133+I133/7.5*0.5)*3600)","v":86400},{"$f":"IF(E133=\"\",\"\",40/1.2)","v":33.333333333333336},{"$f":"IF(B133=\"\",\"\",ISEVEN(B133))","v":true},{"$f":"IF(B133=\"\",\"\",IF(W133=TRUE,IF(F133=\"I\",\"TAK\",\"NIE\"),IF(F133=\"I\",\"NIE\",IF(F133=\"III\",\"NIE\",\"TAK\"))))","v":"NIE"},{"$f":"IF(B133=\"\",\"\",IF(AND(X133=\"NIE\",Z133=\"NIE\"),\"TAK\",\"NIE\"))","v":"TAK"},{"$f":"IF(B133=\"\",\"\",IF(F133=\"III\",\"TAK\",\"NIE\"))","v":"NIE"},{"$f":"IF(E133=\"\",\"\",IF(X133=\"TAK\",\"Zmiana A\",IF(Y133=\"TAK\",\"Zmiana B\",\"Zmiana C\")))","v":"Zmiana B"}]
["środa",10,"marzec",{"$f":"YEAR(Tabela2[[#This Row],[Data]])","v":2018},"2018-03-07","I",6476,7326,33.5,31.493997152095471,0.94011931797299908,30.582978146669252,0.9129247207960971,2.2676616915422887,0.44098288723124179,26,2.1101851851851854,0.47389205792014039,28,{"$f":"IF(E134=\"\",\"\",I134*60*N134)","v":4558},{"$f":"IF(E134=\"\",\"\",(I134+I134/7.5*0.5)*3600)","v":128640},{"$f":"IF(E134=\"\",\"\",40/1.2)","v":33.333333333333336},{"$f":"IF(B134=\"\",\"\",ISEVEN(B134))","v":true},{"$f":"IF(B134=\"\",\"\",IF(W134=TRUE,IF(F134=\"I\",\"TAK\",\"NIE\"),IF(F134=\"I\",\"NIE\",IF(F134=\"III\",\"NIE\",\"TAK\"))))","v":"TAK"},{"$f":"IF(B134=\"\",\"\",IF(AND(X134=\"NIE\",Z134=\"NIE\"),\"TAK\",\"NIE\"))","v":"NIE"},{"$f":"IF(B134=\"\",\"\",IF(F134=\"III\",\"TAK\",\"NIE\"))","v":"NIE"},{"$f":"IF(E134=\"\",\"\",IF(X134=\"TAK\",\"Zmiana A\",IF(Y134=\"TAK\",\"Zmiana B\",\"Zmiana C\")))","v":"Zmiana A"}]
["środa",10,"marzec",{"$f":"YEAR(Tabela2[[#This Row],[Data]])","v":2018},"2018-03-07","II",2445,2845,22.5,19.772624394069005,0.8787833064030669,18.835854457968697,0.83714908702083102,0.89407407407407402,1.1184755592377795,67,0.83819444444444446,1.1930405965202984,72,{"$f":"IF(E135=\"\",\"\",I135*60*N135)","v":1207},{"$f":"IF(E135=\"\",\"\",(I135+I135/7.5*0.5)*3600)","v":86400},{"$f":"IF(E135=\"\",\"\",40/1.2)","v":33.333333333333336},{"$f":"IF(B135=\"\",\"\",ISEVEN(B135))","v":true},{"$f":"IF(B135=\"\",\"\",IF(W135=TRUE,IF(F135=\"I\",\"TAK\",\"NIE\"),IF(F135=\"I\",\"NIE\",IF(F135=\"III\",\"NIE\",\"TAK\"))))","v":"NIE"},{"$f":"IF(B135=\"\",\"\",IF(AND(X135=\"NIE\",Z135=\"NIE\"),\"TAK\",\"NIE\"))","v":"TAK"},{"$f":"IF(B135=\"\",\"\",IF(F135=\"III\",\"TAK\",\"NIE\"))","v":"NIE"},{"$f":"IF(E135=\"\",\"\",IF(X135=\"TAK\",\"Zmiana A\",IF(Y135=\"TAK\",\"Zmiana B\",\"Zmiana C\")))","v":"Zmiana B"}]
["środa",10,"marzec",{"$f":"YEAR(Tabela2[[#This Row],[Data]])","v":2018},"2018-03-07","III",2606,2706,7.5,9.2857142857142847,1.2380952380952379,9.3453576686232243,1.2460476891497632,45.2,2.2123893805309734E-2,1,42.375,2.359882005899705E-2,1,{"$f":"IF(E136=\"\",\"\",I136*60*N136)","v":20340},{"$f":"IF(E136=\"\",\"\",(I136+I136/7.5*0.5)*3600)","v":28800},{"$f":"IF(E136=\"\",\"\",40/1.2)","v":33.333333333333336},{"$f":"IF(B136=\"\",\"\",ISEVEN(B136))","v":true},{"$f":"IF(B136=\"\",\"\",IF(W136=TRUE,IF(F136=\"I\",\"TAK\",\"NIE\"),IF(F136=\"I\",\"NIE\",IF(F136=\"III\",\"NIE\",\"TAK\"))))","v":"NIE"},{"$f":"IF(B136=\"\",\"\",IF(AND(X136=\"NIE\",Z136=\"NIE\"),\"TAK\",\"NIE\"))","v":"NIE"},{"$f":"IF(B136=\"\",\"\",IF(F136=\"III\",\"TAK\",\"NIE\"))","v":"TAK"},{"$f":"IF(E136=\"\",\"\",IF(X136=\"TAK\",\"Zmiana A\",IF(Y136=\"TAK\",\"Zmiana B\",\"Zmiana C\")))","v":"Zmiana C"}]
["czwartek",10,"marzec",{"$f":"YEAR(Tabela2[[#This Row],[Data]])","v":2018},"2018-03-08","I",5109,5709,33.5,28.250845410628013,0.84330881822770187,28.706843411416187,0.8569206988482444,1.9880597014925374,0.50300300300300305,30,1.85,0.54054054054054057,32,{"$f":"IF(E137=\"\",\"\",I137*60*N137)","v":3996},{"$f":"IF(E137=\"\",\"\",(I137+I137/7.5*0.5)*3600)","v":128640},{"$f":"IF(E137=\"\",\"\",40/1.2)","v":33.333333333333336},{"$f":"IF(B137=\"\",\"\",ISEVEN(B137))","v":true},{"$f":"IF(B137=\"\",\"\",IF(W137=TRUE,IF(F137=\"I\",\"TAK\",\"NIE\"),IF(F137=\"I\",\"NIE\",IF(F137=\"III\",\"NIE\",\"TAK\"))))","v":"TAK"},{"$f":"IF(B137=\"\",\"\",IF(AND(X137=\"NIE\",Z137=\"NIE\"),\"TAK\",\"NIE\"))","v":"NIE"},{"$f":"IF(B137=\"\",\"\",IF(F137=\"III\",\"TAK\",\"NIE\"))","v":"NIE"},{"$f":"IF(E137=\"\",\"\",IF(X137=\"TAK\",\"Zmiana A\",IF(Y137=\"TAK\",\"Zmiana B\",\"Zmiana C\")))","v":"Zmiana A"}]
["czwartek",10,"marzec",{"$f":"YEAR(Tabela2[[#This Row],[Data]])","v":2018},"2018-03-08","II",3217,3717,22.5,24.58385753135753,1.0926158902825569,26.108798959842609,1.1603910648818938,1.6333333333333333,0.61224489795918369,37,1.53125,0.65306122448979587,39,{"$f":"IF(E138=\"\",\"\",I138*60*N138)","v":2205},{"$f":"IF(E138=\"\",\"\",(I138+I138/7.5*0.5)*3600)","v":86400},{"$f":"IF(E138=\"\",\"\",40/1.2)","v":33.333333333333336},{"$f":"IF(B138=\"\",\"\",ISEVEN(B138))","v":true},{"$f":"IF(B138=\"\",\"\",IF(W138=TRUE,IF(F138=\"I\",\"TAK\",\"NIE\"),IF(F138=\"I\",\"NIE\",IF(F138=\"III\",\"NIE\",\"TAK\"))))","v":"NIE"},{"$f":"IF(B138=\"\",\"\",IF(AND(X138=\"NIE\",Z138=\"NIE\"),\"TAK\",\"NIE\"))","v":"TAK"},{"$f":"IF(B138=\"\",\"\",IF(F138=\"III\",\"TAK\",\"NIE\"))","v":"NIE"},{"$f":"IF(E138=\"\",\"\",IF(X138=\"TAK\",\"Zmiana A\",IF(Y138=\"TAK\",\"Zmiana B\",\"Zmiana C\")))","v":"Zmiana B"}]
[{"$f":"IF(E139=\"\",\"\",TEXT(WEEKDAY(IF(E139=0,\"\",E139),1),\"dddd\"))","v":"czwartek"},{"$f":"IF(E139=\"\",\"\",WEEKNUM(IF(E139=0,\"\",E139),1))","v":10},{"$f":"IF(E139=\"\",\"\",TEXT(IF(E139=0,\"\",MONTH(E139))*30,\"mmmm\"))","v":"marzec"},{"$f":"YEAR(Tabela2[[#This Row],[Data]])","v":2018},"2018-03-08","III",2624,2674,7.5,9.5515873015873005,1.2735449735449733,11.205363859700753,1.494048514626767,5.3488888888888892,0.18695471541337766,11,5.0145833333333334,0.19941836310760283,12,{"$f":"IF(E139=\"\",\"\",I139*60*N139)","v":2407},{"$f":"IF(E139=\"\",\"\",(I139+I139/7.5*0.5)*3600)","v":28800},{"$f":"IF(E139=\"\",\"\",40/1.2)","v":33.333333333333336},{"$f":"IF(B139=\"\",\"\",ISEVEN(B139))","v":true},{"$f":"IF(B139=\"\",\"\",IF(W139=TRUE,IF(F139=\"I\",\"TAK\",\"NIE\"),IF(F139=\"I\",\"NIE\",IF(F139=\"III\",\"NIE\",\"TAK\"))))","v":"NIE"},{"$f":"IF(B139=\"\",\"\",IF(AND(X139=\"NIE\",Z139=\"NIE\"),\"TAK\",\"NIE\"))","v":"NIE"},{"$f":"IF(B139=\"\",\"\",IF(F139=\"III\",\"TAK\",\"NIE\"))","v":"TAK"},{"$f":"IF(E139=\"\",\"\",IF(X139=\"TAK\",\"Zmiana A\",IF(Y139=\"TAK\",\"Zmiana B\",\"Zmiana C\")))","v":"Zmiana C"}]
["piątek",10,"marzec",{"$f":"YEAR(Tabela2[[#This Row],[Data]])","v":2018},"2018-03-09","I",5947,6747,37.5,32.503215447679196,0.86675241193811192,33.817285529998671,0.9017942807999646,2.0853333333333333,0.479539641943734,29,1.9550000000000001,0.51150895140664965,31,{"$f":"IF(E140=\"\",\"\",I140*60*N140)","v":4692},{"$f":"IF(E140=\"\",\"\",(I140+I140/7.5*0.5)*3600)","v":144000},{"$f":"IF(E140=\"\",\"\",40/1.2)","v":33.333333333333336},{"$f":"IF(B140=\"\",\"\",ISEVEN(B140))","v":true},{"$f":"IF(B140=\"\",\"\",IF(W140=TRUE,IF(F140=\"I\",\"TAK\",\"NIE\"),IF(F140=\"I\",\"NIE\",IF(F140=\"III\",\"NIE\",\"TAK\"))))","v":"TAK"},{"$f":"IF(B140=\"\",\"\",IF(AND(X140=\"NIE\",Z140=\"NIE\"),\"TAK\",\"NIE\"))","v":"NIE"},{"$f":"IF(B140=\"\",\"\",IF(F140=\"III\",\"TAK\",\"NIE\"))","v":"NIE"},{"$f":"IF(E140=\"\",\"\",IF(X140=\"TAK\",\"Zmiana A\",IF(Y140=\"TAK\",\"Zmiana B\",\"Zmiana C\")))","v":"Zmiana A"}]
["piątek",10,"marzec",{"$f":"YEAR(Tabela2[[#This Row],[Data]])","v":2018},"2018-03-09","II",2561,2961,22.5,22.844778856046126,1.0153235047131612,23.393087191420381,1.0396927640631282,1.0074074074074073,0.99264705882352944,60,0.94444444444444442,1.0588235294117647,64,{"$f":"IF(E141=\"\",\"\",I141*60*N141)","v":1359.9999999999998},{"$f":"IF(E141=\"\",\"\",(I141+I141/7.5*0.5)*3600)","v":86400},{"$f":"IF(E141=\"\",\"\",40/1.2)","v":33.333333333333336},{"$f":"IF(B141=\"\",\"\",ISEVEN(B141))","v":true},{"$f":"IF(B141=\"\",\"\",IF(W141=TRUE,IF(F141=\"I\",\"TAK\",\"NIE\"),IF(F141=\"I\",\"NIE\",IF(F141=\"III\",\"NIE\",\"TAK\"))))","v":"NIE"},{"$f":"IF(B141=\"\",\"\",IF(AND(X141=\"NIE\",Z141=\"NIE\"),\"TAK\",\"NIE\"))","v":"TAK"},{"$f":"IF(B141=\"\",\"\",IF(F141=\"III\",\"TAK\",\"NIE\"))","v":"NIE"},{"$f":"IF(E141=\"\",\"\",IF(X141=\"TAK\",\"Zmiana A\",IF(Y141=\"TAK\",\"Zmiana B\",\"Zmiana C\")))","v":"Zmiana B"}]
["piątek",10,"marzec",{"$f":"YEAR(Tabela2[[#This Row],[Data]])","v":2018},"2018-03-09","III",2573,2723,7.5,9.6493930905695606,1.2865857454092748,9.7042262096571879,1.2938968279542917,5.3688888888888888,0.18625827814569537,11,5.0333333333333332,0.19867549668874171,12,{"$f":"IF(E142=\"\",\"\",I142*60*N142)","v":2416},{"$f":"IF(E142=\"\",\"\",(I142+I142/7.5*0.5)*3600)","v":28800},{"$f":"IF(E142=\"\",\"\",40/1.2)","v":33.333333333333336},{"$f":"IF(B142=\"\",\"\",ISEVEN(B142))","v":true},{"$f":"IF(B142=\"\",\"\",IF(W142=TRUE,IF(F142=\"I\",\"TAK\",\"NIE\"),IF(F142=\"I\",\"NIE\",IF(F142=\"III\",\"NIE\",\"TAK\"))))","v":"NIE"},{"$f":"IF(B142=\"\",\"\",IF(AND(X142=\"NIE\",Z142=\"NIE\"),\"TAK\",\"NIE\"))","v":"NIE"},{"$f":"IF(B142=\"\",\"\",IF(F142=\"III\",\"TAK\",\"NIE\"))","v":"TAK"},{"$f":"IF(E142=\"\",\"\",IF(X142=\"TAK\",\"Zmiana A\",IF(Y142=\"TAK\",\"Zmiana B\",\"Zmiana C\")))","v":"Zmiana C"}]
["sobota",10,"marzec",{"$f":"YEAR(Tabela2[[#This Row],[Data]])","v":2018},"2018-03-10","I",3673,3973,22.5,34.669911867185895,1.5408849718749287,35.416546475503495,1.5740687322445999,2.0044444444444443,0.49889135254988914,30,1.8791666666666667,0.53215077605321504,32,{"$f":"IF(E143=\"\",\"\",I143*60*N143)","v":2705.9999999999995},{"$f":"IF(E143=\"\",\"\",(I143+I143/7.5*0.5)*3600)","v":86400},{"$f":"IF(E143=\"\",\"\",40/1.2)","v":33.333333333333336},{"$f":"IF(B143=\"\",\"\",ISEVEN(B143))","v":true},{"$f":"IF(B143=\"\",\"\",IF(W143=TRUE,IF(F143=\"I\",\"TAK\",\"NIE\"),IF(F143=\"I\",\"NIE\",IF(F143=\"III\",\"NIE\",\"TAK\"))))","v":"TAK"},{"$f":"IF(B143=\"\",\"\",IF(AND(X143=\"NIE\",Z143=\"NIE\"),\"TAK\",\"NIE\"))","v":"NIE"},{"$f":"IF(B143=\"\",\"\",IF(F143=\"III\",\"TAK\",\"NIE\"))","v":"NIE"},{"$f":"IF(E143=\"\",\"\",IF(X143=\"TAK\",\"Zmiana A\",IF(Y143=\"TAK\",\"Zmiana B\",\"Zmiana C\")))","v":"Zmiana A"}]
["poniedziałek",11,"marzec",{"$f":"YEAR(Tabela2[[#This Row],[Data]])","v":2018},"2018-03-12","I",5853,6303,30,34.31085143101398,1.1436950477004659,34.912665057879408,1.1637555019293135,2.7672222222222222,0.36137321822927121,22,2.5942708333333333,0.38546476611122266,23,{"$f":"IF(E144=\"\",\"\",I144*60*N144)","v":4981},{"$f":"IF(E144=\"\",\"\",(I144+I144/7.5*0.5)*3600)","v":115200},{"$f":"IF(E144=\"\",\"\",40/1.2)","v":33.333333333333336},{"$f":"IF(B144=\"\",\"\",ISEVEN(B144))","v":false},{"$f":"IF(B144=\"\",\"\",IF(W144=TRUE,IF(F144=\"I\",\"TAK\",\"NIE\"),IF(F144=\"I\",\"NIE\",IF(F144=\"III\",\"NIE\",\"TAK\"))))","v":"NIE"},{"$f":"IF(B144=\"\",\"\",IF(AND(X144=\"NIE\",Z144=\"NIE\"),\"TAK\",\"NIE\"))","v":"TAK"},{"$f":"IF(B144=\"\",\"\",IF(F144=\"III\",\"TAK\",\"NIE\"))","v":"NIE"},{"$f":"IF(E144=\"\",\"\",IF(X144=\"TAK\",\"Zmiana A\",IF(Y144=\"TAK\",\"Zmiana B\",\"Zmiana C\")))","v":"Zmiana B"}]
[{"$f":"IF(E145=\"\",\"\",TEXT(WEEKDAY(IF(E145=0,\"\",E145),1),\"dddd\"))","v":"poniedziałek"},{"$f":"IF(E145=\"\",\"\",WEEKNUM(IF(E145=0,\"\",E145),1))","v":11},{"$f":"IF(E145=\"\",\"\",TEXT(IF(E145=0,\"\",MONTH(E145))*30,\"mmmm\"))","v":"marzec"},{"$f":"YEAR(Tabela2[[#This Row],[Data]])","v":2018},"2018-03-12","II",7758,8508,30,32.463113423982989,1.0821037807994329,32.536076158861718,1.0845358719620573,2.2961111111111112,0.43551899346721512,26,2.1526041666666669,0.46455359303169608,28,{"$f":"IF(E145=\"\",\"\",I145*60*N145)","v":4133},{"$f":"IF(E145=\"\",\"\",(I145+I145/7.5*0.5)*3600)","v":115200},{"$f":"IF(E145=\"\",\"\",40/1.2)","v":33.333333333333336},{"$f":"IF(B145=\"\",\"\",ISEVEN(B145))","v":false},{"$f":"IF(B145=\"\",\"\",IF(W145=TRUE,IF(F145=\"I\",\"TAK\",\"NIE\"),IF(F145=\"I\",\"NIE\",IF(F145=\"III\",\"NIE\",\"TAK\"))))","v":"TAK"},{"$f":"IF(B145=\"\",\"\",IF(AND(X145=\"NIE\",Z145=\"NIE\"),\"TAK\",\"NIE\"))","v":"NIE"},{"$f":"IF(B145=\"\",\"\",IF(F145=\"III\",\"TAK\",\"NIE\"))","v":"NIE"},{"$f":"IF(E145=\"\",\"\",IF(X145=\"TAK\",\"Zmiana A\",IF(Y145=\"TAK\",\"Zmiana B\",\"Zmiana C\")))","v":"Zmiana A"}]
["poniedziałek",11,"marzec",{"$f":"YEAR(Tabela2[[#This Row],[Data]])","v":2018},"2018-03-12","III",2821,2971,13.5,17.765262515262513,1.3159453715009268,19.718364647055918,1.4606196034856236,3.280246913580247,0.30485509973654495,18,3.0540229885057473,0.32743695897628905,20,{"$f":"IF(E146=\"\",\"\",I146*60*N146)","v":2657},{"$f":"IF(E146=\"\",\"\",(I146+I146/7.5*0.5)*3600)","v":51840},{"$f":"IF(E146=\"\",\"\",40/1.2)","v":33.333333333333336},{"$f":"IF(B146=\"\",\"\",ISEVEN(B146))","v":false},{"$f":"IF(B146=\"\",\"\",IF(W146=TRUE,IF(F146=\"I\",\"TAK\",\"NIE\"),IF(F146=\"I\",\"NIE\",IF(F146=\"III\",\"NIE\",\"TAK\"))))","v":"NIE"},{"$f":"IF(B146=\"\",\"\",IF(AND(X146=\"NIE\",Z146=\"NIE\"),\"TAK\",\"NIE\"))","v":"NIE"},{"$f":"IF(B146=\"\",\"\",IF(F146=\"III\",\"TAK\",\"NIE\"))","v":"TAK"},{"$f":"IF(E146=\"\",\"\",IF(X146=\"TAK\",\"Zmiana A\",IF(Y146=\"TAK\",\"Zmiana B\",\"Zmiana C\")))","v":"Zmiana C"}]
["wtorek",11,"marzec",{"$f":"YEAR(Tabela2[[#This Row],[Data]])","v":2018},"2018-03-13","I",6166,4730,30,31.198578570206511,1.0399526190068837,29.810029336811802,0.99366764456039336,2.4461111111111111,0.40881217351805588,25,2.2932291666666669,0.43606631841925958,26,{"$f":"IF(E147=\"\",\"\",I147*60*N147)","v":4403},{"$f":"IF(E147=\"\",\"\",(I147+I147/7.5*0.5)*3600)","v":115200},{"$f":"IF(E147=\"\",\"\",40/1.2)","v":33.333333333333336},{"$f":"IF(B147=\"\",\"\",ISEVEN(B147))","v":false},{"$f":"IF(B147=\"\",\"\",IF(W147=TRUE,IF(F147=\"I\",\"TAK\",\"NIE\"),IF(F147=\"I\",\"NIE\",IF(F147=\"III\",\"NIE\",\"TAK\"))))","v":"NIE"},{"$f":"IF(B147=\"\",\"\",IF(AND(X147=\"NIE\",Z147=\"NIE\"),\"TAK\",\"NIE\"))","v":"TAK"},{"$f":"IF(B147=\"\",\"\",IF(F147=\"III\",\"TAK\",\"NIE\"))","v":"NIE"},{"$f":"IF(E147=\"\",\"\",IF(X147=\"TAK\",\"Zmiana A\",IF(Y147=\"TAK\",\"Zmiana B\",\"Zmiana C\")))","v":"Zmiana B"}]
["wtorek",11,"marzec",{"$f":"YEAR(Tabela2[[#This Row],[Data]])","v":2018},"2018-03-13","II",5193,5893,30,24.23978122901465,0.80799270763382169,25.303180709181643,0.84343935697272143,2.6277777777777778,0.38054968287526425,23,2.4635416666666665,0.40591966173361521,24,{"$f":"IF(E148=\"\",\"\",I148*60*N148)","v":4730},{"$f":"IF(E148=\"\",\"\",(I148+I148/7.5*0.5)*3600)","v":115200},{"$f":"IF(E148=\"\",\"\",40/1.2)","v":33.333333333333336},{"$f":"IF(B148=\"\",\"\",ISEVEN(B148))","v":false},{"$f":"IF(B148=\"\",\"\",IF(W148=TRUE,IF(F148=\"I\",\"TAK\",\"NIE\"),IF(F148=\"I\",\"NIE\",IF(F148=\"III\",\"NIE\",\"TAK\"))))","v":"TAK"},{"$f":"IF(B148=\"\",\"\",IF(AND(X148=\"NIE\",Z148=\"NIE\"),\"TAK\",\"NIE\"))","v":"NIE"},{"$f":"IF(B148=\"\",\"\",IF(F148=\"III\",\"TAK\",\"NIE\"))","v":"NIE"},{"$f":"IF(E148=\"\",\"\",IF(X148=\"TAK\",\"Zmiana A\",IF(Y148=\"TAK\",\"Zmiana B\",\"Zmiana C\")))","v":"Zmiana A"}]
["wtorek",11,"marzec",{"$f":"YEAR(Tabela2[[#This Row],[Data]])","v":2018},"2018-03-13","III",2949,2973,15,18.34349593495935,1.22289972899729,16.89129532061953,1.1260863547079687,3.3033333333333332,0.30272452068617556,18,3.0968749999999998,0.3229061553985873,19,{"$f":"IF(E149=\"\",\"\",I149*60*N149)","v":2973},{"$f":"IF(E149=\"\",\"\",(I149+I149/7.5*0.5)*3600)","v":57600},{"$f":"IF(E149=\"\",\"\",40/1.2)","v":33.333333333333336},{"$f":"IF(B149=\"\",\"\",ISEVEN(B149))","v":false},{"$f":"IF(B149=\"\",\"\",IF(W149=TRUE,IF(F149=\"I\",\"TAK\",\"NIE\"),IF(F149=\"I\",\"NIE\",IF(F149=\"III\",\"NIE\",\"TAK\"))))","v":"NIE"},{"$f":"IF(B149=\"\",\"\",IF(AND(X149=\"NIE\",Z149=\"NIE\"),\"TAK\",\"NIE\"))","v":"NIE"},{"$f":"IF(B149=\"\",\"\",IF(F149=\"III\",\"TAK\",\"NIE\"))","v":"TAK"},{"$f":"IF(E149=\"\",\"\",IF(X149=\"TAK\",\"Zmiana A\",IF(Y149=\"TAK\",\"Zmiana B\",\"Zmiana C\")))","v":"Zmiana C"}]
["środa",11,"marzec",{"$f":"YEAR(Tabela2[[#This Row],[Data]])","v":2018},"2018-03-14","III",4116,2797,15,17.165437873262512,1.1443625248841676,16.470299254692122,1.0980199503128081,3.1077777777777778,0.32177332856632107,19,2.9135416666666667,0.34322488380407579,21,{"$f":"IF(E150=\"\",\"\",I150*60*N150)","v":2797},{"$f":"IF(E150=\"\",\"\",(I150+I150/7.5*0.5)*3600)","v":57600},{"$f":"IF(E150=\"\",\"\",40/1.2)","v":33.333333333333336},{"$f":"IF(B150=\"\",\"\",ISEVEN(B150))","v":false},{"$f":"IF(B150=\"\",\"\",IF(W150=TRUE,IF(F150=\"I\",\"TAK\",\"NIE\"),IF(F150=\"I\",\"NIE\",IF(F150=\"III\",\"NIE\",\"TAK\"))))","v":"NIE"},{"$f":"IF(B150=\"\",\"\",IF(AND(X150=\"NIE\",Z150=\"NIE\"),\"TAK\",\"NIE\"))","v":"NIE"},{"$f":"IF(B150=\"\",\"\",IF(F150=\"III\",\"TAK\",\"NIE\"))","v":"TAK"},{"$f":"IF(E150=\"\",\"\",IF(X150=\"TAK\",\"Zmiana A\",IF(Y150=\"TAK\",\"Zmiana B\",\"Zmiana C\")))","v":"Zmiana C"}]
["czwartek",11,"marzec",{"$f":"YEAR(Tabela2[[#This Row],[Data]])","v":2018},"2018-03-15","III",3156,2758,15,16.807936507936507,1.1205291005291005,16.819661305170836,1.1213107536780558,3.0644444444444443,0.32632342277012327,20,2.8729166666666668,0.34807831762146485,21,{"$f":"IF(E151=\"\",\"\",I151*60*N151)","v":2758},{"$f":"IF(E151=\"\",\"\",(I151+I151/7.5*0.5)*3600)","v":57600},{"$f":"IF(E151=\"\",\"\",40/1.2)","v":33.333333333333336},{"$f":"IF(B151=\"\",\"\",ISEVEN(B151))","v":false},{"$f":"IF(B151=\"\",\"\",IF(W151=TRUE,IF(F151=\"I\",\"TAK\",\"NIE\"),IF(F151=\"I\",\"NIE\",IF(F151=\"III\",\"NIE\",\"TAK\"))))","v":"NIE"},{"$f":"IF(B151=\"\",\"\",IF(AND(X151=\"NIE\",Z151=\"NIE\"),\"TAK\",\"NIE\"))","v":"NIE"},{"$f":"IF(B151=\"\",\"\",IF(F151=\"III\",\"TAK\",\"NIE\"))","v":"TAK"},{"$f":"IF(E151=\"\",\"\",IF(X151=\"TAK\",\"Zmiana A\",IF(Y151=\"TAK\",\"Zmiana B\",\"Zmiana C\")))","v":"Zmiana C"}]
["piątek",11,"marzec",{"$f":"YEAR(Tabela2[[#This Row],[Data]])","v":2018},"2018-03-16","I",1882,1382,37.5,52.960102627615179,1.4122694034030714,52.614604650293515,1.403056124007827,2.7795555555555556,0.35976974736168854,22,2.6058333333333334,0.38375439718580107,23,{"$f":"IF(E152=\"\",\"\",I152*60*N152)","v":6254},{"$f":"IF(E152=\"\",\"\",(I152+I152/7.5*0.5)*3600)","v":144000},{"$f":"IF(E152=\"\",\"\",40/1.2)","v":33.333333333333336},{"$f":"IF(B152=\"\",\"\",ISEVEN(B152))","v":false},{"$f":"IF(B152=\"\",\"\",IF(W152=TRUE,IF(F152=\"I\",\"TAK\",\"NIE\"),IF(F152=\"I\",\"NIE\",IF(F152=\"III\",\"NIE\",\"TAK\"))))","v":"NIE"},{"$f":"IF(B152=\"\",\"\",IF(AND(X152=\"NIE\",Z152=\"NIE\"),\"TAK\",\"NIE\"))","v":"TAK"},{"$f":"IF(B152=\"\",\"\",IF(F152=\"III\",\"TAK\",\"NIE\"))","v":"NIE"},{"$f":"IF(E152=\"\",\"\",IF(X152=\"TAK\",\"Zmiana A\",IF(Y152=\"TAK\",\"Zmiana B\",\"Zmiana C\")))","v":"Zmiana B"}]
["piątek",11,"marzec",{"$f":"YEAR(Tabela2[[#This Row],[Data]])","v":2018},"2018-03-16","II",7432,6254,24,17.704666666666668,0.73769444444444454,17.976944312147399,0.749039346339475,0.95972222222222225,1.0419681620839363,63,0.88589743589743586,1.1287988422575976,68,{"$f":"IF(E153=\"\",\"\",I153*60*N153)","v":1382},{"$f":"IF(E153=\"\",\"\",(I153+I153/7.5*0.5)*3600)","v":92160},{"$f":"IF(E153=\"\",\"\",40/1.2)","v":33.333333333333336},{"$f":"IF(B153=\"\",\"\",ISEVEN(B153))","v":false},{"$f":"IF(B153=\"\",\"\",IF(W153=TRUE,IF(F153=\"I\",\"TAK\",\"NIE\"),IF(F153=\"I\",\"NIE\",IF(F153=\"III\",\"NIE\",\"TAK\"))))","v":"TAK"},{"$f":"IF(B153=\"\",\"\",IF(AND(X153=\"NIE\",Z153=\"NIE\"),\"TAK\",\"NIE\"))","v":"NIE"},{"$f":"IF(B153=\"\",\"\",IF(F153=\"III\",\"TAK\",\"NIE\"))","v":"NIE"},{"$f":"IF(E153=\"\",\"\",IF(X153=\"TAK\",\"Zmiana A\",IF(Y153=\"TAK\",\"Zmiana B\",\"Zmiana C\")))","v":"Zmiana A"}]
["piątek",11,"marzec",{"$f":"YEAR(Tabela2[[#This Row],[Data]])","v":2018},"2018-03-16","III",3647,3134,15,16.246031746031747,1.0830687830687831,16.221564938334442,1.0814376625556295,3.4822222222222221,0.28717294192724951,17,3.2645833333333334,0.3063178047223995,18,{"$f":"IF(E154=\"\",\"\",I154*60*N154)","v":3134},{"$f":"IF(E154=\"\",\"\",(I154+I154/7.5*0.5)*3600)","v":57600},{"$f":"IF(E154=\"\",\"\",40/1.2)","v":33.333333333333336},{"$f":"IF(B154=\"\",\"\",ISEVEN(B154))","v":false},{"$f":"IF(B154=\"\",\"\",IF(W154=TRUE,IF(F154=\"I\",\"TAK\",\"NIE\"),IF(F154=\"I\",\"NIE\",IF(F154=\"III\",\"NIE\",\"TAK\"))))","v":"NIE"},{"$f":"IF(B154=\"\",\"\",IF(AND(X154=\"NIE\",Z154=\"NIE\"),\"TAK\",\"NIE\"))","v":"NIE"},{"$f":"IF(B154=\"\",\"\",IF(F154=\"III\",\"TAK\",\"NIE\"))","v":"TAK"},{"$f":"IF(E154=\"\",\"\",IF(X154=\"TAK\",\"Zmiana A\",IF(Y154=\"TAK\",\"Zmiana B\",\"Zmiana C\")))","v":"Zmiana C"}]
["poniedziałek",12,"marzec",{"$f":"YEAR(Tabela2[[#This Row],[Data]])","v":2018},"2018-03-19","I",12999,10360,37.5,39.470454323254927,1.0525454486201313,38.532118211539846,1.0275231523077293,2.3022222222222224,0.43436293436293438,26,2.1583333333333332,0.46332046332046334,28,{"$f":"IF(E155=\"\",\"\",I155*60*N155)","v":5180},{"$f":"IF(E155=\"\",\"\",(I155+I155/7.5*0.5)*3600)","v":144000},{"$f":"IF(E155=\"\",\"\",40/1.2)","v":33.333333333333336},{"$f":"IF(B155=\"\",\"\",ISEVEN(B155))","v":true},{"$f":"IF(B155=\"\",\"\",IF(W155=TRUE,IF(F155=\"I\",\"TAK\",\"NIE\"),IF(F155=\"I\",\"NIE\",IF(F155=\"III\",\"NIE\",\"TAK\"))))","v":"TAK"},{"$f":"IF(B155=\"\",\"\",IF(AND(X155=\"NIE\",Z155=\"NIE\"),\"TAK\",\"NIE\"))","v":"NIE"},{"$f":"IF(B155=\"\",\"\",IF(F155=\"III\",\"TAK\",\"NIE\"))","v":"NIE"},{"$f":"IF(E155=\"\",\"\",IF(X155=\"TAK\",\"Zmiana A\",IF(Y155=\"TAK\",\"Zmiana B\",\"Zmiana C\")))","v":"Zmiana A"}]
["poniedziałek",12,"marzec",{"$f":"YEAR(Tabela2[[#This Row],[Data]])","v":2018},"2018-03-19","I",12999,10360,37.5,39.470454323254927,1.0525454486201313,38.252673148300879,1.0200712839546902,2.3022222222222224,0.43436293436293438,26,2.1583333333333332,0.46332046332046334,28,{"$f":"IF(E156=\"\",\"\",I156*60*N156)","v":5180},{"$f":"IF(E156=\"\",\"\",(I156+I156/7.5*0.5)*3600)","v":144000},{"$f":"IF(E156=\"\",\"\",40/1.2)","v":33.333333333333336},{"$f":"IF(B156=\"\",\"\",ISEVEN(B156))","v":true},{"$f":"IF(B156=\"\",\"\",IF(W156=TRUE,IF(F156=\"I\",\"TAK\",\"NIE\"),IF(F156=\"I\",\"NIE\",IF(F156=\"III\",\"NIE\",\"TAK\"))))","v":"TAK"},{"$f":"IF(B156=\"\",\"\",IF(AND(X156=\"NIE\",Z156=\"NIE\"),\"TAK\",\"NIE\"))","v":"NIE"},{"$f":"IF(B156=\"\",\"\",IF(F156=\"III\",\"TAK\",\"NIE\"))","v":"NIE"},{"$f":"IF(E156=\"\",\"\",IF(X156=\"TAK\",\"Zmiana A\",IF(Y156=\"TAK\",\"Zmiana B\",\"Zmiana C\")))","v":"Zmiana A"}]
["poniedziałek",12,"marzec",{"$f":"YEAR(Tabela2[[#This Row],[Data]])","v":2018},"2018-03-19","II",3779,3395,22.5,26.97595704948646,1.1989314244216205,28.180720812724413,1.2524764805655295,2.5148148148148146,0.39764359351988215,24,2.3576388888888888,0.42415316642120765,25,{"$f":"IF(E157=\"\",\"\",I157*60*N157)","v":3394.9999999999995},{"$f":"IF(E157=\"\",\"\",(I157+I157/7.5*0.5)*3600)","v":86400},{"$f":"IF(E157=\"\",\"\",40/1.2)","v":33.333333333333336},{"$f":"IF(B157=\"\",\"\",ISEVEN(B157))","v":true},{"$f":"IF(B157=\"\",\"\",IF(W157=TRUE,IF(F157=\"I\",\"TAK\",\"NIE\"),IF(F157=\"I\",\"NIE\",IF(F157=\"III\",\"NIE\",\"TAK\"))))","v":"NIE"},{"$f":"IF(B157=\"\",\"\",IF(AND(X157=\"NIE\",Z157=\"NIE\"),\"TAK\",\"NIE\"))","v":"TAK"},{"$f":"IF(B157=\"\",\"\",IF(F157=\"III\",\"TAK\",\"NIE\"))","v":"NIE"},{"$f":"IF(E157=\"\",\"\",IF(X157=\"TAK\",\"Zmiana A\",IF(Y157=\"TAK\",\"Zmiana B\",\"Zmiana C\")))","v":"Zmiana B"}]
["poniedziałek",12,"marzec",{"$f":"YEAR(Tabela2[[#This Row],[Data]])","v":2018},"2018-03-19","III",4034,3865,22.5,24.977049486461247,1.1100910882871666,25.881228048961489,1.1502768021760661,2.8629629629629632,0.34928848641655885,21,2.6840277777777777,0.37257438551099614,22,{"$f":"IF(E158=\"\",\"\",I158*60*N158)","v":3865.0000000000005},{"$f":"IF(E158=\"\",\"\",(I158+I158/7.5*0.5)*3600)","v":86400},{"$f":"IF(E158=\"\",\"\",40/1.2)","v":33.333333333333336},{"$f":"IF(B158=\"\",\"\",ISEVEN(B158))","v":true},{"$f":"IF(B158=\"\",\"\",IF(W158=TRUE,IF(F158=\"I\",\"TAK\",\"NIE\"),IF(F158=\"I\",\"NIE\",IF(F158=\"III\",\"NIE\",\"TAK\"))))","v":"NIE"},{"$f":"IF(B158=\"\",\"\",IF(AND(X158=\"NIE\",Z158=\"NIE\"),\"TAK\",\"NIE\"))","v":"NIE"},{"$f":"IF(B158=\"\",\"\",IF(F158=\"III\",\"TAK\",\"NIE\"))","v":"TAK"},{"$f":"IF(E158=\"\",\"\",IF(X158=\"TAK\",\"Zmiana A\",IF(Y158=\"TAK\",\"Zmiana B\",\"Zmiana C\")))","v":"Zmiana C"}]
["wtorek",12,"marzec",{"$f":"YEAR(Tabela2[[#This Row],[Data]])","v":2018},"2018-03-20","I",6816,5595,37.5,46.223472017030502,1.2326259204541468,46.95817586767069,1.252218023137885,2.4866666666666668,0.40214477211796246,24,2.3312499999999998,0.42895442359249331,26,{"$f":"IF(E159=\"\",\"\",I159*60*N159)","v":5595},{"$f":"IF(E159=\"\",\"\",(I159+I159/7.5*0.5)*3600)","v":144000},{"$f":"IF(E159=\"\",\"\",40/1.2)","v":33.333333333333336},{"$f":"IF(B159=\"\",\"\",ISEVEN(B159))","v":true},{"$f":"IF(B159=\"\",\"\",IF(W159=TRUE,IF(F159=\"I\",\"TAK\",\"NIE\"),IF(F159=\"I\",\"NIE\",IF(F159=\"III\",\"NIE\",\"TAK\"))))","v":"TAK"},{"$f":"IF(B159=\"\",\"\",IF(AND(X159=\"NIE\",Z159=\"NIE\"),\"TAK\",\"NIE\"))","v":"NIE"},{"$f":"IF(B159=\"\",\"\",IF(F159=\"III\",\"TAK\",\"NIE\"))","v":"NIE"},{"$f":"IF(E159=\"\",\"\",IF(X159=\"TAK\",\"Zmiana A\",IF(Y159=\"TAK\",\"Zmiana B\",\"Zmiana C\")))","v":"Zmiana A"}]
[{"$f":"IF(E160=\"\",\"\",TEXT(WEEKDAY(IF(E160=0,\"\",E160),1),\"dddd\"))","v":"wtorek"},{"$f":"IF(E160=\"\",\"\",WEEKNUM(IF(E160=0,\"\",E160),1))","v":12},{"$f":"IF(E160=\"\",\"\",TEXT(IF(E160=0,\"\",MONTH(E160))*30,\"mmmm\"))","v":"marzec"},{"$f":"YEAR(Tabela2[[#This Row],[Data]])","v":2018},"2018-03-20","II",3809,3055,22.5,23.036962487697782,1.0238649994532347,23.707108363100762,1.0536492605822561,2.2629629629629631,0.44189852700491,27,2.1215277777777777,0.47135842880523732,28,{"$f":"IF(E160=\"\",\"\",I160*60*N160)","v":3055},{"$f":"IF(E160=\"\",\"\",(I160+I160/7.5*0.5)*3600)","v":86400},{"$f":"IF(E160=\"\",\"\",40/1.2)","v":33.333333333333336},{"$f":"IF(B160=\"\",\"\",ISEVEN(B160))","v":true},{"$f":"IF(B160=\"\",\"\",IF(W160=TRUE,IF(F160=\"I\",\"TAK\",\"NIE\"),IF(F160=\"I\",\"NIE\",IF(F160=\"III\",\"NIE\",\"TAK\"))))","v":"NIE"},{"$f":"IF(B160=\"\",\"\",IF(AND(X160=\"NIE\",Z160=\"NIE\"),\"TAK\",\"NIE\"))","v":"TAK"},{"$f":"IF(B160=\"\",\"\",IF(F160=\"III\",\"TAK\",\"NIE\"))","v":"NIE"},{"$f":"IF(E160=\"\",\"\",IF(X160=\"TAK\",\"Zmiana A\",IF(Y160=\"TAK\",\"Zmiana B\",\"Zmiana C\")))","v":"Zmiana B"}]
["wtorek",12,"marzec",{"$f":"YEAR(Tabela2[[#This Row],[Data]])","v":2018},"2018-03-20","III",3712,3144,22.5,23.638888888888889,1.0506172839506174,21.670297890717361,0.9631243506985494,2.3288888888888888,0.42938931297709926,26,2.1833333333333331,0.4580152671755725,27,{"$f":"IF(E161=\"\",\"\",I161*60*N161)","v":3144},{"$f":"IF(E161=\"\",\"\",(I161+I161/7.5*0.5)*3600)","v":86400},{"$f":"IF(E161=\"\",\"\",40/1.2)","v":33.333333333333336},{"$f":"IF(B161=\"\",\"\",ISEVEN(B161))","v":true},{"$f":"IF(B161=\"\",\"\",IF(W161=TRUE,IF(F161=\"I\",\"TAK\",\"NIE\"),IF(F161=\"I\",\"NIE\",IF(F161=\"III\",\"NIE\",\"TAK\"))))","v":"NIE"},{"$f":"IF(B161=\"\",\"\",IF(AND(X161=\"NIE\",Z161=\"NIE\"),\"TAK\",\"NIE\"))","v":"NIE"},{"$f":"IF(B161=\"\",\"\",IF(F161=\"III\",\"TAK\",\"NIE\"))","v":"TAK"},{"$f":"IF(E161=\"\",\"\",IF(X161=\"TAK\",\"Zmiana A\",IF(Y161=\"TAK\",\"Zmiana B\",\"Zmiana C\")))","v":"Zmiana C"}]
["środa",12,"marzec",{"$f":"YEAR(Tabela2[[#This Row],[Data]])","v":2018},"2018-03-21","I",6051,4613,37.5,35.212945633844818,0.93901188356919518,35.965922220750429,0.95909125922001148,2.0502222222222222,0.48775200520268808,29,1.9220833333333334,0.52026880554953392,31,{"$f":"IF(E162=\"\",\"\",I162*60*N162)","v":4613},{"$f":"IF(E162=\"\",\"\",(I162+I162/7.5*0.5)*3600)","v":144000},{"$f":"IF(E162=\"\",\"\",40/1.2)","v":33.333333333333336},{"$f":"IF(B162=\"\",\"\",ISEVEN(B162))","v":true},{"$f":"IF(B162=\"\",\"\",IF(W162=TRUE,IF(F162=\"I\",\"TAK\",\"NIE\"),IF(F162=\"I\",\"NIE\",IF(F162=\"III\",\"NIE\",\"TAK\"))))","v":"TAK"},{"$f":"IF(B162=\"\",\"\",IF(AND(X162=\"NIE\",Z162=\"NIE\"),\"TAK\",\"NIE\"))","v":"NIE"},{"$f":"IF(B162=\"\",\"\",IF(F162=\"III\",\"TAK\",\"NIE\"))","v":"NIE"},{"$f":"IF(E162=\"\",\"\",IF(X162=\"TAK\",\"Zmiana A\",IF(Y162=\"TAK\",\"Zmiana B\",\"Zmiana C\")))","v":"Zmiana A"}]
["środa",12,"marzec",{"$f":"YEAR(Tabela2[[#This Row],[Data]])","v":2018},"2018-03-21","II",1963,1558,14.5,15.958483607392465,1.1005850763718941,15.29515530328009,1.0548382967779373,1.7908045977011495,0.55840821566110399,34,1.6229166666666666,0.6161745827984596,37,{"$f":"IF(E163=\"\",\"\",I163*60*N163)","v":1558},{"$f":"IF(E163=\"\",\"\",(I163+I163/7.5*0.5)*3600)","v":55680},{"$f":"IF(E163=\"\",\"\",40/1.2)","v":33.333333333333336},{"$f":"IF(B163=\"\",\"\",ISEVEN(B163))","v":true},{"$f":"IF(B163=\"\",\"\",IF(W163=TRUE,IF(F163=\"I\",\"TAK\",\"NIE\"),IF(F163=\"I\",\"NIE\",IF(F163=\"III\",\"NIE\",\"TAK\"))))","v":"NIE"},{"$f":"IF(B163=\"\",\"\",IF(AND(X163=\"NIE\",Z163=\"NIE\"),\"TAK\",\"NIE\"))","v":"TAK"},{"$f":"IF(B163=\"\",\"\",IF(F163=\"III\",\"TAK\",\"NIE\"))","v":"NIE"},{"$f":"IF(E163=\"\",\"\",IF(X163=\"TAK\",\"Zmiana A\",IF(Y163=\"TAK\",\"Zmiana B\",\"Zmiana C\")))","v":"Zmiana B"}]
["środa",12,"marzec",{"$f":"YEAR(Tabela2[[#This Row],[Data]])","v":2018},"2018-03-21","III",3441,2651,18,14.681746031746032,0.81565255731922404,16.662617193808583,0.92570095521158791,2.4546296296296295,0.4073934364390796,24,2.2658119658119658,0.44134288947566958,26,{"$f":"IF(E164=\"\",\"\",I164*60*N164)","v":2651},{"$f":"IF(E164=\"\",\"\",(I164+I164/7.5*0.5)*3600)","v":69120},{"$f":"IF(E164=\"\",\"\",40/1.2)","v":33.333333333333336},{"$f":"IF(B164=\"\",\"\",ISEVEN(B164))","v":true},{"$f":"IF(B164=\"\",\"\",IF(W164=TRUE,IF(F164=\"I\",\"TAK\",\"NIE\"),IF(F164=\"I\",\"NIE\",IF(F164=\"III\",\"NIE\",\"TAK\"))))","v":"NIE"},{"$f":"IF(B164=\"\",\"\",IF(AND(X164=\"NIE\",Z164=\"NIE\"),\"TAK\",\"NIE\"))","v":"NIE"},{"$f":"IF(B164=\"\",\"\",IF(F164=\"III\",\"TAK\",\"NIE\"))","v":"TAK"},{"$f":"IF(E164=\"\",\"\",IF(X164=\"TAK\",\"Zmiana A\",IF(Y164=\"TAK\",\"Zmiana B\",\"Zmiana C\")))","v":"Zmiana C"}]
["czwartek",12,"marzec",{"$f":"YEAR(Tabela2[[#This Row],[Data]])","v":2018},"2018-03-22","I",6777,4889,31.5,30.43242035006023,0.9661085825415946,32.174497219473778,1.0214126101420247,2.5867724867724866,0.38658212313356516,23,2.3965686274509803,0.4172632440171814,25,{"$f":"IF(E165=\"\",\"\",I165*60*N165)","v":4889},{"$f":"IF(E165=\"\",\"\",(I165+I165/7.5*0.5)*3600)","v":120960},{"$f":"IF(E165=\"\",\"\",40/1.2)","v":33.333333333333336},{"$f":"IF(B165=\"\",\"\",ISEVEN(B165))","v":true},{"$f":"IF(B165=\"\",\"\",IF(W165=TRUE,IF(F165=\"I\",\"TAK\",\"NIE\"),IF(F165=\"I\",\"NIE\",IF(F165=\"III\",\"NIE\",\"TAK\"))))","v":"TAK"},{"$f":"IF(B165=\"\",\"\",IF(AND(X165=\"NIE\",Z165=\"NIE\"),\"TAK\",\"NIE\"))","v":"NIE"},{"$f":"IF(B165=\"\",\"\",IF(F165=\"III\",\"TAK\",\"NIE\"))","v":"NIE"},{"$f":"IF(E165=\"\",\"\",IF(X165=\"TAK\",\"Zmiana A\",IF(Y165=\"TAK\",\"Zmiana B\",\"Zmiana C\")))","v":"Zmiana A"}]
[{"$f":"IF(E166=\"\",\"\",TEXT(WEEKDAY(IF(E166=0,\"\",E166),1),\"dddd\"))","v":"czwartek"},{"$f":"IF(E166=\"\",\"\",WEEKNUM(IF(E166=0,\"\",E166),1))","v":12},{"$f":"IF(E166=\"\",\"\",TEXT(IF(E166=0,\"\",MONTH(E166))*30,\"mmmm\"))","v":"marzec"},{"$f":"YEAR(Tabela2[[#This Row],[Data]])","v":2018},"2018-03-22","II",3211,2795,22.5,10.964427426047695,0.48730788560211979,12.671008965889875,0.56315595403954999,1.4192592592592592,0.70459290187891443,42,1.3305555555555555,0.75156576200417535,45,{"$f":"IF(E166=\"\",\"\",I166*60*N166)","v":1916},{"$f":"IF(E166=\"\",\"\",(I166+I166/7.5*0.5)*3600)","v":86400},{"$f":"IF(E166=\"\",\"\",40/1.2)","v":33.333333333333336},{"$f":"IF(B166=\"\",\"\",ISEVEN(B166))","v":true},{"$f":"IF(B166=\"\",\"\",IF(W166=TRUE,IF(F166=\"I\",\"TAK\",\"NIE\"),IF(F166=\"I\",\"NIE\",IF(F166=\"III\",\"NIE\",\"TAK\"))))","v":"NIE"},{"$f":"IF(B166=\"\",\"\",IF(AND(X166=\"NIE\",Z166=\"NIE\"),\"TAK\",\"NIE\"))","v":"TAK"},{"$f":"IF(B166=\"\",\"\",IF(F166=\"III\",\"TAK\",\"NIE\"))","v":"NIE"},{"$f":"IF(E166=\"\",\"\",IF(X166=\"TAK\",\"Zmiana A\",IF(Y166=\"TAK\",\"Zmiana B\",\"Zmiana C\")))","v":"Zmiana B"}]
[{"$f":"IF(E167=\"\",\"\",TEXT(WEEKDAY(IF(E167=0,\"\",E167),1),\"dddd\"))","v":"czwartek"},{"$f":"IF(E167=\"\",\"\",WEEKNUM(IF(E167=0,\"\",E167),1))","v":12},{"$f":"IF(E167=\"\",\"\",TEXT(IF(E167=0,\"\",MONTH(E167))*30,\"mmmm\"))","v":"marzec"},{"$f":"YEAR(Tabela2[[#This Row],[Data]])","v":2018},"2018-03-22","II",3211,2795,15,4.9406697819314633,0.32937798546209757,3.9962280020867729,0.26641520013911818,0.97666666666666668,1.0238907849829351,61,0.91562500000000002,1.0921501706484642,66,{"$f":"IF(E167=\"\",\"\",I167*60*N167)","v":879},{"$f":"IF(E167=\"\",\"\",(I167+I167/7.5*0.5)*3600)","v":57600},{"$f":"IF(E167=\"\",\"\",40/1.2)","v":33.333333333333336},{"$f":"IF(B167=\"\",\"\",ISEVEN(B167))","v":true},{"$f":"IF(B167=\"\",\"\",IF(W167=TRUE,IF(F167=\"I\",\"TAK\",\"NIE\"),IF(F167=\"I\",\"NIE\",IF(F167=\"III\",\"NIE\",\"TAK\"))))","v":"NIE"},{"$f":"IF(B167=\"\",\"\",IF(AND(X167=\"NIE\",Z167=\"NIE\"),\"TAK\",\"NIE\"))","v":"TAK"},{"$f":"IF(B167=\"\",\"\",IF(F167=\"III\",\"TAK\",\"NIE\"))","v":"NIE"},{"$f":"IF(E167=\"\",\"\",IF(X167=\"TAK\",\"Zmiana A\",IF(Y167=\"TAK\",\"Zmiana B\",\"Zmiana C\")))","v":"Zmiana B"}]
[{"$f":"IF(E168=\"\",\"\",TEXT(WEEKDAY(IF(E168=0,\"\",E168),1),\"dddd\"))","v":"czwartek"},{"$f":"IF(E168=\"\",\"\",WEEKNUM(IF(E168=0,\"\",E168),1))","v":12},{"$f":"IF(E168=\"\",\"\",TEXT(IF(E168=0,\"\",MONTH(E168))*30,\"mmmm\"))","v":"marzec"},{"$f":"YEAR(Tabela2[[#This Row],[Data]])","v":2018},"2018-03-22","III",3838,3180,22.5,23.699577955792911,1.0533145758130182,21.919066076135699,0.97418071449491994,2.3555555555555556,0.42452830188679247,25,2.2083333333333335,0.45283018867924529,27,{"$f":"IF(E168=\"\",\"\",I168*60*N168)","v":3180},{"$f":"IF(E168=\"\",\"\",(I168+I168/7.5*0.5)*3600)","v":86400},{"$f":"IF(E168=\"\",\"\",40/1.2)","v":33.333333333333336},{"$f":"IF(B168=\"\",\"\",ISEVEN(B168))","v":true},{"$f":"IF(B168=\"\",\"\",IF(W168=TRUE,IF(F168=\"I\",\"TAK\",\"NIE\"),IF(F168=\"I\",\"NIE\",IF(F168=\"III\",\"NIE\",\"TAK\"))))","v":"NIE"},{"$f":"IF(B168=\"\",\"\",IF(AND(X168=\"NIE\",Z168=\"NIE\"),\"TAK\",\"NIE\"))","v":"NIE"},{"$f":"IF(B168=\"\",\"\",IF(F168=\"III\",\"TAK\",\"NIE\"))","v":"TAK"},{"$f":"IF(E168=\"\",\"\",IF(X168=\"TAK\",\"Zmiana A\",IF(Y168=\"TAK\",\"Zmiana B\",\"Zmiana C\")))","v":"Zmiana C"}]
[]
[]
[]
[]
[]
[]
[]
[]
[]
[]
[]
[]
[]
[]
[]
[]
[]
[]
[]
[]
[]
[]
[null,null,null,null,null,null,null,null,null,null,null,3]

{"sheet":"Wykresy","index":3,"n_rows":220,"n_cols":76,"rows_kept":220,"cut":false,"hidden":false,"merged":[]}
[null,null,null,null,null,null,null,null,null,null,null,null,null,null,null,null,null,null,null,null,null,null,null,null,null,null,null,null,null,null,null,null,null,null,null,null,null,null,null,null,null,null,null,null,null,null,null,null,null,null,null,null,null,"Miesiąc","(Wszystko)",null,null,"Rok:",2018,null,null,null,null,null,null,null,null,null,null,null,null,"Rok:",2018]
[]
[null,null,null,null,null,null,null,null,null,null,null,null,null,null,null,null,null,null,null,null,null,null,null,null,null,null,null,null,null,null,null,null,null,null,null,null,null,null,null,null,null,null,null,null,null,null,null,null,null,null,null,null,null,"Etykiety wierszy","Średnia z Wsp. pakowania przy 8h [s/szt]",null,null,"Suma z % Wydajność","Etykiety kolumn",null,null,null,null,null,null,null,null,null,null,null,null,"Średnia z % Wydajność","Etykiety kolumn"]
[null,null,null,null,null,null,null,null,null,null,null,null,null,null,null,null,null,null,null,null,null,null,null,null,null,null,null,null,null,null,null,null,null,null,null,null,null,null,null,null,null,null,null,null,null,null,null,null,null,null,null,null,null,"1900-01-01",null,null,null,"Etykiety wierszy","Zmiana B","Zmiana A","Zmiana C","Suma końcowa",null,null,null,null,null,null,null,null,null,"Etykiety wierszy","Zmiana B","Zmiana A","Zmiana C","Suma końcowa"]
[null,null,null,null,null,null,null,null,null,null,null,null,null,null,null,null,null,null,null,null,null,null,null,null,null,null,null,null,null,null,null,null,null,null,null,null,null,null,null,null,null,null,null,null,null,null,null,null,null,null,null,null,null,"(puste)",null,null,null,"Styczeń",0.75621252019207363,0.79689782395903919,0.87548063663059528,0.80099287642761097,null,null,null,null,null,null,null,null,null,1,0.84333053691275173,0.90836012861736337,0.80977530247743423,0.8661804108365585]
[null,null,null,null,null,null,null,null,null,null,null,null,null,null,null,null,null,null,null,null,null,null,null,null,null,null,null,null,null,null,null,null,null,null,null,null,null,null,null,null,null,null,null,null,null,null,null,null,null,null,null,null,null,"(puste)",null,null,null,"Luty",1.0774991024260143,1.0656117329216519,1.0241746771939866,1.0576604686704025,null,null,null,null,null,null,null,null,null,2,0.71958603210363281,0.72903469396316656,0.86139374160107507,0.75555457331447429]
[null,null,null,null,null,null,null,null,null,null,null,null,null,null,null,null,null,null,null,null,null,null,null,null,null,null,null,null,null,null,null,null,null,null,null,null,null,null,null,null,null,null,null,null,null,null,null,null,null,null,null,null,null,"(puste)",null,null,null,"Marzec",0.98400219398482491,0.96952262342241202,0.92514687593807621,0.96358984360488875,null,null,null,null,null,null,null,null,null,3,0.75568695080890202,0.74966977258933987,0.94724220623501199,0.78372052009683679]
[null,null,null,null,null,null,null,null,null,null,null,null,null,null,null,null,null,null,null,null,null,null,null,null,null,null,null,null,null,null,null,null,null,null,null,null,null,null,null,null,null,null,null,null,null,null,null,null,null,null,null,null,null,"2018-01-03",37.333333333333336,null,null,"Suma końcowa",0.8919601675440455,0.94891393001716295,0.94197142107397602,0.93341362308618725,null,null,null,null,null,null,null,null,null,4,0.71953738124741839,0.81555364425824706,0.85980309852705483,0.80604398295538027]
[null,null,null,null,null,null,null,null,null,null,null,null,null,null,null,null,null,null,null,null,null,null,null,null,null,null,null,null,null,null,null,null,null,null,null,null,null,null,null,null,null,null,null,null,null,null,null,null,null,null,null,null,null,"I",24,null,null,null,null,null,null,null,null,null,null,null,null,null,null,null,null,5,0.72801490815511583,0.73278273611296119,0.87704086806611903,0.77852799947557316]
[null,null,null,null,null,null,null,null,null,null,null,null,null,null,null,null,null,null,null,null,null,null,null,null,null,null,null,null,null,null,null,null,null,null,null,null,null,null,null,null,null,null,null,null,null,null,null,null,null,null,null,null,null,"II",61,null,null,null,null,null,null,null,null,null,null,null,null,null,null,null,null,6,1.0586928563077282,1.0415560950821523,1.0077759263667381,1.0366220085545619]
[null,null,null,null,null,null,null,null,null,null,null,null,null,null,null,null,null,null,null,null,null,null,null,null,null,null,null,null,null,null,null,null,null,null,null,null,null,null,null,null,null,null,null,null,null,null,null,null,null,null,null,null,null,"III",27,null,null,null,null,null,null,null,null,null,null,null,null,null,null,null,null,7,1.1331642358909322,1.0968176460683616,1.0547645125958378,1.1013490495332834]
[null,null,null,null,null,null,null,null,null,null,null,null,null,null,null,null,null,null,null,null,null,null,null,null,null,null,null,null,null,null,null,null,null,null,null,null,null,null,null,null,null,null,null,null,null,null,null,null,null,null,null,null,null,"2018-01-05",35.666666666666664,null,null,null,null,null,null,null,null,null,null,null,null,null,null,null,null,8,1.1742497579864473,1.1081163392721181,1.0658947566600772,1.0987408432636803]
[null,null,null,null,null,null,null,null,null,null,null,null,null,null,null,null,null,null,null,null,null,null,null,null,null,null,null,null,null,null,null,null,null,null,null,null,null,null,null,null,null,null,null,null,null,null,null,null,null,null,null,null,null,"I",33,null,null,null,null,null,null,null,null,null,null,null,null,null,null,null,null,9,1.1342790249276959,1.1191448234490344,1.0669433659124381,1.1128857395133618]
[null,null,null,null,null,null,null,null,null,null,null,null,null,null,null,null,null,null,null,null,null,null,null,null,null,null,null,null,null,null,null,null,null,null,null,null,null,null,null,null,null,null,null,null,null,null,null,null,null,null,null,null,null,"II",51,null,null,null,null,null,null,null,null,null,null,null,null,null,null,null,null,10,1.1393534002229655,1.122215719351396,1.0500136400836593,1.1130094322833244]
[null,null,null,null,null,null,null,null,null,null,null,null,null,null,null,null,null,null,null,null,null,null,null,null,null,null,null,null,null,null,null,null,null,null,null,null,null,null,null,null,null,null,null,null,null,null,null,null,null,null,null,null,null,"III",23,null,null,null,null,null,null,null,null,null,null,null,null,null,null,null,null,11,0.85788648479147067,0.93613955964796891,0.87680508119120382,0.90147607762960213]
[null,null,null,null,null,null,null,null,null,null,null,null,null,null,null,null,null,null,null,null,null,null,null,null,null,null,null,null,null,null,null,null,null,null,null,null,null,null,null,null,null,null,null,null,null,null,null,null,null,null,null,null,null,"2018-01-08",26,null,null,null,null,null,null,null,null,null,null,null,null,null,null,null,null,12,0.84649741419840152,0.7798609196458659,0.85457570715474207,0.81251034254509347]
[null,null,null,null,null,null,null,null,null,null,null,null,null,null,null,null,null,null,null,null,null,null,null,null,null,null,null,null,null,null,null,null,null,null,null,null,null,null,null,null,null,null,null,null,null,null,null,null,null,null,null,null,null,"I",28,null,null,null,null,null,null,null,null,null,null,null,null,null,null,null,null,"Suma końcowa",0.8919601675440455,0.94891393001716295,0.94197142107397602,0.93341362308618725]
[null,null,null,null,null,null,null,null,null,null,null,null,null,null,null,null,null,null,null,null,null,null,null,null,null,null,null,null,null,null,null,null,null,null,null,null,null,null,null,null,null,null,null,null,null,null,null,null,null,null,null,null,null,"II",28]
[null,null,null,null,null,null,null,null,null,null,null,null,null,null,null,null,null,null,null,null,null,null,null,null,null,null,null,null,null,null,null,null,null,null,null,null,null,null,null,null,null,null,null,null,null,null,null,null,null,null,null,null,null,"III",22]
[null,null,null,null,null,null,null,null,null,null,null,null,null,null,null,null,null,null,null,null,null,null,null,null,null,null,null,null,null,null,null,null,null,null,null,null,null,null,null,null,null,null,null,null,null,null,null,null,null,null,null,null,null,"2018-01-09",28.333333333333332]
[null,null,null,null,null,null,null,null,null,null,null,null,null,null,null,null,null,null,null,null,null,null,null,null,null,null,null,null,null,null,null,null,null,null,null,null,null,null,null,null,null,null,null,null,null,null,null,null,null,null,null,null,null,"I",36]
[null,null,null,null,null,null,null,null,null,null,null,null,null,null,null,null,null,null,null,null,null,null,null,null,null,null,null,null,null,null,null,null,null,null,null,null,null,null,null,null,null,null,null,null,null,null,null,null,null,null,null,null,null,"II",29]
[null,null,"Wartości",null,null,null,null,null,null,null,null,null,"Wartości",null,null,null,null,null,null,null,null,null,null,null,null,null,null,null,null,null,null,null,null,null,null,null,null,null,null,null,null,null,null,null,null,null,null,null,null,null,null,null,null,"III",20]
[null,"Etykiety wierszy","Suma z s/szt","Średnia z Cel miesięczny (s/szt.) ",null,null,null,null,null,null,null,"Etykiety wierszy","Suma z Zrealizowana ilość ","Suma z % braków",null,null,null,null,null,null,null,null,null,null,null,null,null,null,null,null,null,null,null,null,null,null,null,null,null,null,null,null,null,null,null,null,null,null,null,null,null,null,null,"2018-01-10",29.333333333333332]
[null,"styczeń",28.822456086859169,33.333333333333314,null,null,null,null,null,null,null,2018,571824,1.4941660371023253E-2,null,null,null,null,null,null,null,null,null,null,null,null,null,null,null,null,null,null,null,null,"Obciążenie stanowisk","Etykiety kolumn",null,null,null,null,null,null,null,null,null,null,null,null,null,null,null,null,null,"I",21]
[null,"luty",29.2749263387798,33.333333333333307,null,null,null,null,null,null,null,"Styczeń",209903,1.6035978523413194E-2,null,null,null,null,null,null,null,null,null,null,null,null,null,null,null,null,null,null,null,null,"Miesiąc","Zmiana A","Zmiana B","Zmiana C","Średnia:",null,null,null,null,null,null,null,null,null,null,null,null,null,null,"II",46]
[null,"marzec",25.649742449768286,33.333333333333314,null,null,null,null,null,null,null,"Luty",194132,9.9365380256732534E-3,null,null,null,null,null,null,null,null,null,null,null,null,null,null,null,null,null,null,null,null,"styczeń",0.94657493098398182,1.0302765413686326,1.1817555559788893,1.0502114828717246,null,null,null,null,null,null,null,null,null,null,null,null,null,null,"III",21]
[null,"Suma końcowa",27.972005208333332,33.333333333333279,null,null,null,null,null,null,null,"Marzec",167789,1.9363605480693012E-2,null,null,null,null,null,null,null,null,null,null,null,null,null,null,null,null,null,null,null,null,"luty",0.82774512051678861,0.98139365256164135,0.97797598569410338,0.9242690191090247,null,null,null,null,null,null,null,null,null,null,null,null,null,null,"2018-01-11",28.333333333333332]
[null,null,null,null,null,null,null,null,null,null,null,"Suma końcowa",571824,1.4941660371023253E-2,null,null,null,null,null,null,null,null,null,null,null,null,null,null,null,null,null,null,null,null,"marzec",0.98054453905539096,1.0048902831199584,1.1697217190053253,1.0457010958297892,null,null,null,null,null,null,null,null,null,null,null,null,null,null,"I",32]
[null,null,null,null,null,null,null,null,null,null,null,null,null,null,null,null,null,null,null,null,null,null,null,null,null,null,null,null,null,null,null,null,null,null,"Średnia:",0.90882369112875927,1.0051367645552829,1.1025342706251473,1.0014308636620175,null,null,null,null,null,null,null,null,null,null,null,null,null,null,"II",33]
[null,null,null,null,null,null,null,null,null,null,null,null,null,null,null,null,null,null,null,null,null,null,null,null,null,null,null,null,null,null,null,null,null,null,null,null,null,null,null,null,null,null,null,null,null,null,null,null,null,null,null,null,null,"III",20]
[null,null,null,null,null,null,null,null,null,null,null,null,null,null,null,null,null,null,null,null,null,null,null,null,null,null,null,null,null,null,null,null,null,null,null,null,null,null,null,null,null,null,null,null,null,null,null,null,null,null,null,null,null,"2018-01-12",36.333333333333336]
[null,null,null,null,null,null,null,null,null,null,null,null,null,null,null,null,null,null,null,null,null,null,null,null,null,null,null,null,null,null,null,null,null,null,"Zmiana","(Wszystko)",null,null,null,null,null,null,null,null,null,null,null,null,null,null,null,null,null,"II",48.5]
[null,null,null,null,null,null,null,null,null,null,null,null,null,null,null,null,null,null,null,null,null,null,null,null,null,null,null,null,null,null,null,null,null,null,null,null,null,null,null,null,null,null,null,null,null,null,null,null,null,null,null,null,null,"III",12]
[null,null,null,null,null,null,null,null,null,null,null,null,null,null,null,null,null,null,null,null,null,null,null,null,null,null,null,null,null,null,null,null,null,null,null,"Wartości",null,null,null,null,null,null,null,null,null,null,null,null,null,null,null,null,null,"2018-01-15",38]
[null,null,null,null,null,null,null,null,null,null,null,null,null,null,null,null,null,null,null,null,null,null,null,null,null,null,null,null,null,null,null,null,null,null,"Etykiety wierszy"," Planowana produkcja","Czas Dostępny","Zakładany Czas",null,null,null,null,null,null,null,null,null,null,null,null,null,null,null,"I",31]
[null,null,null,null,null,null,null,null,null,null,null,null,null,null,null,null,null,null,null,null,null,null,null,null,null,null,null,null,null,null,null,null,null,null,"styczeń",281900,1352.5,1409.5160658880916,null,null,null,null,null,null,null,null,null,null,null,null,null,null,null,"II",45]
[null,null,null,null,null,null,null,null,null,null,null,null,null,null,null,null,null,null,null,null,null,null,null,null,null,null,null,null,null,null,null,null,null,null,"luty",285810,1457.5,1583.7836952857087,null,null,null,null,null,null,null,null,null,null,null,null,null,null,null,"2018-01-16",12]
[null,null,null,null,null,null,null,null,null,null,null,null,null,null,null,null,null,null,null,null,null,null,null,null,null,null,null,null,null,null,null,null,null,null,"marzec",227613,1131,1174.2678060748324,null,null,null,null,null,null,null,null,null,null,null,null,null,null,null,"III",12]
[null,null,null,null,null,null,null,null,null,null,null,null,null,null,null,null,null,null,null,null,null,null,null,null,null,null,null,null,null,null,null,null,null,null,"Suma końcowa",795323,3941,4167.5675672486323,null,null,null,null,null,null,null,null,null,null,null,null,null,null,null,"2018-01-17",12,null,null,null,null,"Rok:",2018]
[null,null,null,null,null,null,null,null,null,null,null,null,null,null,null,null,null,null,null,null,null,null,null,null,null,null,null,null,null,null,null,null,null,null,null,null,null,null,null,null,null,null,null,null,null,null,null,null,null,null,null,null,null,"III",12,null,null,null,null,"Miesiąc:","Marzec"]
[null,null,null,null,null,null,null,null,null,null,null,null,null,null,null,null,null,null,null,null,null,null,null,null,null,null,null,null,null,null,null,null,null,null,null,null,null,null,null,null,null,null,null,null,null,null,null,null,null,null,null,null,null,"2018-01-18",28.333333333333332]
[null,null,null,null,null,null,null,null,null,null,null,null,null,null,null,null,null,null,null,null,null,null,null,null,null,null,null,null,null,null,null,null,null,null,null,null,null,null,null,null,null,null,null,null,null,null,null,null,null,null,null,null,null,"I",31,null,null,null,null,"Etykiety wierszy"," Planowana Ilość"," Zrealizowana ilość"]
[null,null,null,null,null,null,null,null,null,null,null,null,null,null,null,null,null,null,null,null,null,null,null,null,null,null,null,null,null,null,null,null,null,null,null,null,null,null,null,null,null,null,null,null,null,null,null,null,null,null,null,null,null,"II",42,null,null,null,null,"Zmiana B",54695,53820]
[null,null,null,null,null,null,null,null,null,null,null,null,null,null,null,null,null,null,null,null,null,null,null,null,null,null,null,null,null,null,null,null,null,null,null,null,null,null,null,null,null,null,null,null,null,null,null,null,null,null,null,null,null,"III",12,null,null,null,null,"Zmiana A",114019,110544]
[null,null,null,null,null,null,null,null,null,null,null,null,null,null,null,null,null,null,null,null,null,null,null,null,null,null,null,null,null,null,null,null,null,null,null,null,null,null,null,null,null,null,null,null,null,null,null,null,null,null,null,null,null,"2018-01-19",37.75,null,null,null,null,"Zmiana C",46638,43147]
[null,null,null,null,null,null,null,null,null,null,null,null,null,null,null,null,null,null,null,null,null,null,null,null,null,null,null,null,null,null,null,null,null,null,null,null,null,null,null,null,null,null,null,null,null,null,null,null,null,null,null,null,null,"I",32,null,null,null,null,"Suma końcowa",215352,207511]
[null,null,null,null,null,null,null,null,null,null,null,null,null,null,null,null,null,null,null,null,null,null,null,null,null,null,null,null,null,null,null,null,null,null,null,null,null,null,null,null,null,null,null,null,null,null,null,null,null,null,null,null,null,"II",75]
[null,null,null,null,null,null,null,null,null,null,null,null,null,null,null,null,null,null,null,null,null,null,null,null,null,null,null,null,null,null,null,null,null,null,null,null,null,null,null,null,null,null,null,null,null,null,null,null,null,null,null,null,null,"III",12]
[null,null,null,null,null,null,null,null,null,null,null,null,null,null,null,null,null,null,null,null,null,null,null,null,null,null,null,null,null,null,null,null,null,null,null,null,null,null,null,null,null,null,null,null,null,null,null,null,null,null,null,null,null,"2018-01-22",33.333333333333336]
[null,null,null,null,null,null,null,null,null,null,null,null,null,null,null,null,null,null,null,null,null,null,null,null,null,null,null,null,null,null,null,null,null,null,null,null,null,null,null,null,null,null,null,null,null,null,null,null,null,null,null,null,null,"I",21]
[null,null,null,null,null,null,null,null,null,null,null,null,null,null,null,null,null,null,null,null,null,null,null,null,null,null,null,null,null,null,null,null,null,null,null,null,null,null,null,null,null,null,null,null,null,null,null,null,null,null,null,null,null,"II",49]
[null,null,null,null,null,null,null,null,null,null,null,null,null,null,null,null,null,null,null,null,null,null,null,null,null,null,null,null,null,null,null,null,null,null,null,null,null,null,null,null,null,null,null,null,null,null,null,null,null,null,null,null,null,"III",30]
[null,null,null,null,null,null,null,null,null,null,null,null,null,null,null,null,null,null,null,null,null,null,null,null,null,null,null,null,null,null,null,null,null,null,null,null,null,null,null,null,null,null,null,null,null,null,null,null,null,null,null,null,null,"2018-01-23",40.4]
[null,null,null,null,null,null,null,null,null,null,null,null,null,null,null,null,null,null,null,null,null,null,null,null,null,null,null,null,null,null,null,null,null,null,null,null,null,null,null,null,null,null,null,null,null,null,null,null,null,null,null,null,null,"I",39.666666666666664]
[null,null,null,null,null,null,null,null,null,null,null,null,null,null,null,null,null,null,null,null,null,null,null,null,null,null,null,null,null,null,null,null,null,null,null,null,null,null,null,null,null,null,null,null,null,null,null,null,null,null,null,null,null,"II",59]
[null,null,null,null,null,null,null,null,null,null,null,null,null,null,null,null,null,null,null,null,null,null,null,null,null,null,null,null,null,null,null,null,null,null,null,null,null,null,null,null,null,null,null,null,null,null,null,null,null,null,null,null,null,"III",24]
[null,null,null,null,null,null,null,null,null,null,null,null,null,null,null,null,null,null,null,null,null,null,null,null,null,null,null,null,null,null,null,null,null,null,null,null,null,null,null,null,null,null,null,null,null,null,null,null,null,null,null,null,null,"2018-01-24",28.5]
[null,null,null,null,null,null,null,null,null,null,null,null,null,null,null,null,null,null,null,null,null,null,null,null,null,null,null,null,null,null,null,null,null,null,null,null,null,null,null,null,null,null,null,null,null,null,null,null,null,null,null,null,null,"I",23]
[null,null,null,null,null,null,null,null,null,null,null,null,null,null,null,null,null,null,null,null,null,null,null,null,null,null,null,null,null,null,null,null,null,null,null,null,null,null,null,null,null,null,null,null,null,null,null,null,null,null,null,null,null,"II",34]
[null,null,null,null,null,null,null,null,null,null,null,null,null,null,null,null,null,null,null,null,null,null,null,null,null,null,null,null,null,null,null,null,null,null,null,null,null,null,null,null,null,null,null,null,null,null,null,null,null,null,null,null,null,"2018-01-25",40.5]
[null,null,null,null,null,null,null,null,null,null,null,null,null,null,null,null,null,null,null,null,null,null,null,null,null,null,null,null,null,null,null,null,null,null,null,null,null,null,null,null,null,null,null,null,null,null,null,null,null,null,null,null,null,"I",27]
[null,null,null,null,null,null,null,null,null,null,null,null,null,null,null,null,null,null,null,null,null,null,null,null,null,null,null,null,null,null,null,null,null,null,null,null,null,null,null,null,null,null,null,null,null,null,null,null,null,null,null,null,null,"II",54]
[null,null,null,null,null,null,null,null,null,null,null,null,null,null,null,null,null,null,null,null,null,null,null,null,null,null,null,null,null,null,null,null,null,null,null,null,null,null,null,null,null,null,null,null,null,null,null,null,null,null,null,null,null,"2018-01-26",30.333333333333332]
[null,null,null,null,null,null,null,null,null,null,null,null,null,null,null,null,null,null,null,null,null,null,null,null,null,null,null,null,null,null,null,null,null,null,null,null,null,null,null,null,null,null,null,null,null,null,null,null,null,null,null,null,null,"II",67]
[null,"Etykiety wierszy","Suma z s/szt",null,null,null,null,null,null,null,null,null,null,null,null,null,null,null,null,null,null,null,null,null,null,null,null,null,null,null,null,null,null,null,null,null,null,null,null,null,null,null,null,null,null,null,null,null,null,null,null,null,null,"III",12]
[null,1,31.437779394947501,null,null,null,null,null,null,null,null,null,null,null,null,null,null,null,null,null,null,null,null,null,null,null,null,null,null,null,null,null,null,null,"Zmiana","(Wszystko)",null,null,null,null,null,null,null,null,null,null,null,null,null,null,null,null,null,"2018-01-27",16]
[null,2,28.64218716483688,null,null,null,null,null,null,null,null,null,null,null,null,null,null,null,null,null,null,null,null,null,null,null,null,null,null,null,null,null,null,null,null,null,null,null,null,null,null,null,null,null,null,null,null,null,null,null,null,null,null,"I",16]
[null,3,28.067393458870168,null,null,null,null,null,null,null,null,null,null,null,null,null,null,null,null,null,null,null,null,null,null,null,null,null,null,null,null,null,null,null,null,"Wartości",null,null,null,null,null,null,null,null,null,null,null,null,null,null,null,null,null,"2018-01-29",37.666666666666664]
[null,4,27.339126207692775,null,null,null,null,null,null,null,null,null,null,null,null,null,null,null,null,null,null,null,null,null,null,null,null,null,null,null,null,null,null,null,"Etykiety wierszy","Planowanw Obciążenie [%]","Faktyczne obciążenie [%]",null,null,null,null,null,null,null,null,null,null,null,null,null,null,null,null,"I",17]
[null,5,29.706346700347332,null,null,null,null,null,null,null,null,null,null,null,null,null,null,null,null,null,null,null,null,null,null,null,null,null,null,null,null,null,null,null,"styczeń",1.0502114828717244,1.0423657483836302,null,null,null,null,null,null,null,null,null,null,null,null,null,null,null,null,"II",72]
[null,6,28.160564622849581,null,null,null,null,null,null,null,null,null,null,null,null,null,null,null,null,null,null,null,null,null,null,null,null,null,null,null,null,null,null,null,"luty",0.92426901910902459,0.75382589022042679,null,null,null,null,null,null,null,null,null,null,null,null,null,null,null,null,"III",24]
[null,7,29.207541982634197,null,null,null,null,null,null,null,null,null,null,null,null,null,null,null,null,null,null,null,null,null,null,null,null,null,null,null,null,null,null,null,"marzec",1.0457010958297892,1.055912079668696,null,null,null,null,null,null,null,null,null,null,null,null,null,null,null,null,"2018-01-30",32]
[null,8,26.861058972456242,null,null,null,null,null,null,null,null,null,null,null,null,null,null,null,null,null,null,null,null,null,null,null,null,null,null,null,null,null,null,null,"Suma końcowa",1.0014308636620177,0.93732782327055397,null,null,null,null,null,null,null,null,null,null,null,null,null,null,null,null,"I",24]
[null,9,30.250747361356844,null,null,null,null,null,null,null,null,null,null,null,null,null,null,null,null,null,null,null,null,null,null,null,null,null,null,null,null,null,null,null,null,null,null,null,null,null,null,null,null,null,null,null,null,null,null,null,null,null,null,"II",50]
[null,10,21.016949152542374,null,null,null,null,null,null,null,null,null,null,null,null,null,null,null,null,null,null,null,null,null,null,null,null,null,null,null,null,null,null,null,null,null,null,null,null,null,null,null,null,null,null,null,null,null,null,null,null,null,null,"III",22]
[null,11,24.356997164320184,null,null,null,null,null,null,null,null,null,null,null,null,null,null,null,null,null,null,null,null,null,null,null,null,null,null,null,null,null,null,null,null,null,null,null,null,null,null,null,null,null,null,null,null,null,null,null,null,null,null,"2018-01-31",32.666666666666664]
[null,12,28.467617107942974,null,null,null,null,null,null,null,null,null,null,null,null,null,null,null,null,null,null,null,null,null,null,null,null,null,null,null,null,null,null,null,null,null,null,null,null,null,null,null,null,null,null,null,null,null,null,null,null,null,null,"I",27]
[null,"Suma końcowa",27.574103362073362,null,null,null,null,null,null,null,null,null,null,null,null,null,null,null,null,null,null,null,null,null,null,null,null,null,null,null,null,null,null,null,null,null,null,null,null,null,null,null,null,null,null,null,null,null,null,null,null,null,null,"II",48]
[null,null,null,null,null,null,null,null,null,null,null,null,null,null,null,null,null,null,null,null,null,null,null,null,null,null,null,null,null,null,null,null,null,null,null,null,null,null,null,null,null,null,null,null,null,null,null,null,null,null,null,null,null,"III",23]
[null,null,null,null,null,null,null,null,null,null,null,null,null,null,null,null,null,null,null,null,null,null,null,null,null,null,null,null,null,null,null,null,null,null,null,null,null,null,null,null,null,null,null,null,null,null,null,null,null,null,null,null,null,"2018-02-01",39.333333333333336]
[null,null,null,null,null,null,null,null,null,null,null,null,null,null,null,null,null,null,null,null,null,null,null,null,null,null,null,null,null,null,null,null,null,null,null,null,null,null,null,null,null,null,null,null,null,null,null,null,null,null,null,null,null,"I",27]
[null,null,null,null,null,null,null,null,null,null,null,null,null,null,null,null,null,null,null,null,null,null,null,null,null,null,null,null,null,null,null,null,null,null,null,null,null,null,null,null,null,null,null,null,null,null,null,null,null,null,null,null,null,"II",66]
[null,null,null,null,null,null,null,null,null,null,null,null,null,null,null,null,null,null,null,null,null,null,null,null,null,null,null,null,null,null,null,null,null,null,null,null,null,null,null,null,null,null,null,null,null,null,null,null,null,null,null,null,null,"III",25]
[null,null,null,null,null,null,null,null,null,null,null,null,null,null,null,null,null,null,null,null,null,null,null,null,null,null,null,null,null,null,null,null,null,null,null,null,null,null,null,null,null,null,null,null,null,null,null,null,null,null,null,null,null,"2018-02-02",41]
[null,null,null,null,null,null,null,null,null,null,null,null,null,null,null,null,null,null,null,null,null,null,null,null,null,null,null,null,null,null,null,null,null,null,null,null,null,null,null,null,null,null,null,null,null,null,null,null,null,null,null,null,null,"I",50]
[null,null,null,null,null,null,null,null,null,null,null,null,null,null,null,null,null,null,null,null,null,null,null,null,null,null,null,null,null,null,null,null,null,null,null,null,null,null,null,null,null,null,null,null,null,null,null,null,null,null,null,null,null,"II",50]
[null,null,null,null,null,null,null,null,null,null,null,null,null,null,null,null,null,null,null,null,null,null,null,null,null,null,null,null,null,null,null,null,null,null,null,null,null,null,null,null,null,null,null,null,null,null,null,null,null,null,null,null,null,"III",23]
[null,null,null,null,null,null,null,null,null,null,null,null,null,null,null,null,null,null,null,null,null,null,null,null,null,null,null,null,null,null,null,null,null,null,null,null,null,null,null,null,null,null,null,null,null,null,null,null,null,null,null,null,null,"2018-02-05",46.5]
[null,null,null,null,null,null,null,null,null,null,null,null,null,null,null,null,null,null,null,null,null,null,null,null,null,null,null,null,null,null,null,null,null,null,null,null,null,null,null,null,null,null,null,null,null,null,null,null,null,null,null,null,null,"I",30]
[null,null,null,null,null,null,null,null,null,null,null,null,null,null,null,null,null,null,null,null,null,null,null,null,null,null,null,null,null,null,null,null,null,null,null,null,null,null,null,null,null,null,null,null,null,null,null,null,null,null,null,null,null,"II",63]
[null,null,null,null,null,null,null,null,null,null,null,null,null,null,null,null,null,null,null,null,null,null,null,null,null,null,null,null,null,null,null,null,null,null,null,null,null,null,null,null,null,null,null,null,null,null,null,null,null,null,null,null,null,"2018-02-06",31.25]
[null,null,null,null,null,null,null,null,null,null,null,null,null,null,null,null,null,null,null,null,null,null,null,null,null,null,null,null,null,null,null,null,null,null,null,null,null,null,null,null,null,null,null,null,null,null,null,null,null,null,null,null,null,"I",28]
[null,null,null,null,null,null,null,null,null,null,null,null,null,null,null,null,null,null,null,null,null,null,null,null,null,null,null,null,null,null,null,null,null,null,null,null,null,null,null,null,null,null,null,null,null,null,null,null,null,null,null,null,null,"II",73]
[null,null,null,null,null,null,null,null,null,null,null,null,null,null,null,null,null,null,null,null,null,null,null,null,null,null,null,null,null,null,null,null,null,null,null,null,null,null,null,null,null,null,null,null,null,null,null,null,null,null,null,null,null,"III",12]
[null,null,null,null,null,null,null,null,null,null,null,null,null,null,null,null,null,null,null,null,null,null,null,null,null,null,null,null,null,null,null,null,null,null,null,null,null,null,null,null,null,null,null,null,null,null,null,null,null,null,null,null,null,"2018-02-07",42]
[null,null,null,null,null,null,null,null,null,null,null,null,null,null,null,null,null,null,null,null,null,null,null,null,null,null,null,null,null,null,null,null,null,null,null,null,null,null,null,null,null,null,null,null,null,null,null,null,null,null,null,null,null,"I",32]
[null,null,null,null,null,null,null,null,null,null,null,null,null,null,null,null,null,null,null,null,null,null,null,null,null,null,null,null,null,null,null,null,null,null,null,null,null,null,null,null,null,null,null,null,null,null,null,null,null,null,null,null,null,"II",82]
[null,null,null,null,null,null,null,null,null,null,null,null,null,null,null,null,null,null,null,null,null,null,null,null,null,null,null,null,null,null,null,null,null,null,null,null,null,null,null,null,null,null,null,null,null,null,null,null,null,null,null,null,null,"III",12]
[null,null,null,null,null,null,null,null,null,null,null,null,null,null,null,null,null,null,null,null,null,null,null,null,null,null,null,null,null,null,null,null,null,null,null,null,null,null,null,null,null,null,null,null,null,null,null,null,null,null,null,null,null,"2018-02-08",40]
[null,null,null,null,null,null,null,null,null,null,null,null,null,null,null,null,null,null,null,null,null,null,null,null,null,null,null,null,null,null,null,null,null,null,null,null,null,null,null,null,null,null,null,null,null,null,null,null,null,null,null,null,null,"I",25]
[null,null,null,null,null,null,null,null,null,null,null,null,null,null,null,null,null,null,null,null,null,null,null,null,null,null,null,null,null,null,null,null,null,null,null,null,null,null,null,null,null,null,null,null,null,null,null,null,null,null,null,null,null,"II",83]
[null,null,null,null,null,null,null,null,null,null,null,null,null,null,null,null,null,null,null,null,null,null,null,null,null,null,null,null,null,null,null,null,null,null,null,null,null,null,null,null,null,null,null,null,null,null,null,null,null,null,null,null,null,"III",12]
[null,null,null,null,null,null,null,null,null,null,null,null,null,null,null,null,null,null,null,null,null,null,null,null,null,null,null,null,null,null,null,null,null,null,null,null,null,null,null,null,null,null,null,null,null,null,null,null,null,null,null,null,null,"2018-02-09",32]
[null,null,null,null,null,null,null,null,null,null,null,null,null,null,null,null,null,null,null,null,null,null,null,null,null,null,null,null,null,null,null,null,null,null,null,null,null,null,null,null,null,null,null,null,null,null,null,null,null,null,null,null,null,"I",32]
[null,null,null,null,null,null,null,null,null,null,null,null,null,null,null,null,null,null,null,null,null,null,null,null,null,null,null,null,null,null,null,null,null,null,null,null,null,null,null,null,null,null,null,null,null,null,null,null,null,null,null,null,null,"II",52]
[null,null,null,null,null,null,null,null,null,null,null,null,null,null,null,null,null,null,null,null,null,null,null,null,null,null,null,null,null,null,null,null,null,null,null,null,null,null,null,null,null,null,null,null,null,null,null,null,null,null,null,null,null,"III",12]
[null,null,null,null,null,null,null,null,null,null,null,null,null,null,null,null,null,null,null,null,null,null,null,null,null,null,null,null,null,null,null,null,null,null,null,null,null,null,null,null,null,null,null,null,null,null,null,null,null,null,null,null,null,"2018-02-10",16]
[null,null,null,null,null,null,null,null,null,null,null,null,null,null,null,null,null,null,null,null,null,null,null,null,null,null,null,null,null,null,null,null,null,null,null,null,null,null,null,null,null,null,null,null,null,null,null,null,null,null,null,null,null,"I",16]
[null,null,null,null,null,null,null,null,null,null,null,null,null,null,null,null,null,null,null,null,null,null,null,null,null,null,null,null,null,null,null,null,null,null,null,null,null,null,null,null,null,null,null,null,null,null,null,null,null,null,null,null,null,"2018-02-12",18.333333333333332]
[null,null,null,null,null,null,null,null,null,null,null,null,null,null,null,null,null,null,null,null,null,null,null,null,null,null,null,null,null,null,null,null,null,null,null,null,null,null,null,null,null,null,null,null,null,null,null,null,null,null,null,null,null,"I",26]
[null,null,null,null,null,null,null,null,null,null,null,null,null,null,null,null,null,null,null,null,null,null,null,null,null,null,null,null,null,null,null,null,null,null,null,null,null,null,null,null,null,null,null,null,null,null,null,null,null,null,null,null,null,"II",17]
[null,null,null,null,null,null,null,null,null,null,null,null,null,null,null,null,null,null,null,null,null,null,null,null,null,null,null,null,null,null,null,null,null,null,null,null,null,null,null,null,null,null,null,null,null,null,null,null,null,null,null,null,null,"III",12]
[null,null,null,null,null,null,null,null,null,null,null,null,null,null,null,null,null,null,null,null,null,null,null,null,null,null,null,null,null,null,null,null,null,null,null,null,null,null,null,null,null,null,null,null,null,null,null,null,null,null,null,null,null,"2018-02-13",42.5]
[null,null,null,null,null,null,null,null,null,null,null,null,null,null,null,null,null,null,null,null,null,null,null,null,null,null,null,null,null,null,null,null,null,null,null,null,null,null,null,null,null,null,null,null,null,null,null,null,null,null,null,null,null,"I",24]
[null,null,null,null,null,null,null,null,null,null,null,null,null,null,null,null,null,null,null,null,null,null,null,null,null,null,null,null,null,null,null,null,null,null,null,null,null,null,null,null,null,null,null,null,null,null,null,null,null,null,null,null,null,"II",67]
[null,null,null,null,null,null,null,null,null,null,null,null,null,null,null,null,null,null,null,null,null,null,null,null,null,null,null,null,null,null,null,null,null,null,null,null,null,null,null,null,null,null,null,null,null,null,null,null,null,null,null,null,null,"III",12]
[null,null,null,null,null,null,null,null,null,null,null,null,null,null,null,null,null,null,null,null,null,null,null,null,null,null,null,null,null,null,null,null,null,null,null,null,null,null,null,null,null,null,null,null,null,null,null,null,null,null,null,null,null,"2018-02-14",44.666666666666664]
[null,null,null,null,null,null,null,null,null,null,null,null,null,null,null,null,null,null,null,null,null,null,null,null,null,null,null,null,null,null,null,null,null,null,null,null,null,null,null,null,null,null,null,null,null,null,null,null,null,null,null,null,null,"I",22]
[null,null,null,null,null,null,null,null,null,null,null,null,null,null,null,null,null,null,null,null,null,null,null,null,null,null,null,null,null,null,null,null,null,null,null,null,null,null,null,null,null,null,null,null,null,null,null,null,null,null,null,null,null,"II",94]
[null,null,null,null,null,null,null,null,null,null,null,null,null,null,null,null,null,null,null,null,null,null,null,null,null,null,null,null,null,null,null,null,null,null,null,null,null,null,null,null,null,null,null,null,null,null,null,null,null,null,null,null,null,"III",18]
[null,null,null,null,null,null,null,null,null,null,null,null,null,null,null,null,null,null,null,null,null,null,null,null,null,null,null,null,null,null,null,null,null,null,null,null,null,null,null,null,null,null,null,null,null,null,null,null,null,null,null,null,null,"2018-02-15",50]
[null,null,null,null,null,null,null,null,null,null,null,null,null,null,null,null,null,null,null,null,null,null,null,null,null,null,null,null,null,null,null,null,null,null,null,null,null,null,null,null,null,null,null,null,null,null,null,null,null,null,null,null,null,"I",34]
[null,null,null,null,null,null,null,null,null,null,null,null,null,null,null,null,null,null,null,null,null,null,null,null,null,null,null,null,null,null,null,null,null,null,null,null,null,null,null,null,null,null,null,null,null,null,null,null,null,null,null,null,null,"II",66]
[null,null,null,null,null,null,null,null,null,null,null,null,null,null,null,null,null,null,null,null,null,null,null,null,null,null,null,null,null,null,null,null,null,null,null,null,null,null,null,null,null,null,null,null,null,null,null,null,null,null,null,null,null,"2018-02-16",43]
[null,null,null,null,null,null,null,null,null,null,null,null,null,null,null,null,null,null,null,null,null,null,null,null,null,null,null,null,null,null,null,null,null,null,null,null,null,null,null,null,null,null,null,null,null,null,null,null,null,null,null,null,null,"I",30]
[null,null,null,null,null,null,null,null,null,null,null,null,null,null,null,null,null,null,null,null,null,null,null,null,null,null,null,null,null,null,null,null,null,null,null,null,null,null,null,null,null,null,null,null,null,null,null,null,null,null,null,null,null,"II",56]
[null,null,null,null,null,null,null,null,null,null,null,null,null,null,null,null,null,null,null,null,null,null,null,null,null,null,null,null,null,null,null,null,null,null,null,null,null,null,null,null,null,null,null,null,null,null,null,null,null,null,null,null,null,"2018-02-19",29]
[null,null,null,null,null,null,null,null,null,null,null,null,null,null,null,null,null,null,null,null,null,null,null,null,null,null,null,null,null,null,null,null,null,null,null,null,null,null,null,null,null,null,null,null,null,null,null,null,null,null,null,null,null,"I",21]
[null,null,null,null,null,null,null,null,null,null,null,null,null,null,null,null,null,null,null,null,null,null,null,null,null,null,null,null,null,null,null,null,null,null,null,null,null,null,null,null,null,null,null,null,null,null,null,null,null,null,null,null,null,"II",47]
[null,null,null,null,null,null,null,null,null,null,null,null,null,null,null,null,null,null,null,null,null,null,null,null,null,null,null,null,null,null,null,null,null,null,null,null,null,null,null,null,null,null,null,null,null,null,null,null,null,null,null,null,null,"III",19]
[null,null,null,null,null,null,null,null,null,null,null,null,null,null,null,null,null,null,null,null,null,null,null,null,null,null,null,null,null,null,null,null,null,null,null,null,null,null,null,null,null,null,null,null,null,null,null,null,null,null,null,null,null,"2018-02-20",33]
[null,null,null,null,null,null,null,null,null,null,null,null,null,null,null,null,null,null,null,null,null,null,null,null,null,null,null,null,null,null,null,null,null,null,null,null,null,null,null,null,null,null,null,null,null,null,null,null,null,null,null,null,null,"I",28]
[null,null,null,null,null,null,null,null,null,null,null,null,null,null,null,null,null,null,null,null,null,null,null,null,null,null,null,null,null,null,null,null,null,null,null,null,null,null,null,null,null,null,null,null,null,null,null,null,null,null,null,null,null,"II",53]
[null,null,null,null,null,null,null,null,null,null,null,null,null,null,null,null,null,null,null,null,null,null,null,null,null,null,null,null,null,null,null,null,null,null,null,null,null,null,null,null,null,null,null,null,null,null,null,null,null,null,null,null,null,"III",18]
[null,null,null,null,null,null,null,null,null,null,null,null,null,null,null,null,null,null,null,null,null,null,null,null,null,null,null,null,null,null,null,null,null,null,null,null,null,null,null,null,null,null,null,null,null,null,null,null,null,null,null,null,null,"2018-02-21",22.333333333333332]
[null,null,null,null,null,null,null,null,null,null,null,null,null,null,null,null,null,null,null,null,null,null,null,null,null,null,null,null,null,null,null,null,null,null,null,null,null,null,null,null,null,null,null,null,null,null,null,null,null,null,null,null,null,"I",29]
[null,null,null,null,null,null,null,null,null,null,null,null,null,null,null,null,null,null,null,null,null,null,null,null,null,null,null,null,null,null,null,null,null,null,null,null,null,null,null,null,null,null,null,null,null,null,null,null,null,null,null,null,null,"III",19]
[null,null,null,null,null,null,null,null,null,null,null,null,null,null,null,null,null,null,null,null,null,null,null,null,null,null,null,null,null,null,null,null,null,null,null,null,null,null,null,null,null,null,null,null,null,null,null,null,null,null,null,null,null,"2018-02-22",35.5]
[null,null,null,null,null,null,null,null,null,null,null,null,null,null,null,null,null,null,null,null,null,null,null,null,null,null,null,null,null,null,null,null,null,null,null,null,null,null,null,null,null,null,null,null,null,null,null,null,null,null,null,null,null,"II",50]
[null,null,null,null,null,null,null,null,null,null,null,null,null,null,null,null,null,null,null,null,null,null,null,null,null,null,null,null,null,null,null,null,null,null,null,null,null,null,null,null,null,null,null,null,null,null,null,null,null,null,null,null,null,"III",21]
[null,null,null,null,null,null,null,null,null,null,null,null,null,null,null,null,null,null,null,null,null,null,null,null,null,null,null,null,null,null,null,null,null,null,null,null,null,null,null,null,null,null,null,null,null,null,null,null,null,null,null,null,null,"2018-02-23",28.333333333333332]
[null,null,null,null,null,null,null,null,null,null,null,null,null,null,null,null,null,null,null,null,null,null,null,null,null,null,null,null,null,null,null,null,null,null,null,null,null,null,null,null,null,null,null,null,null,null,null,null,null,null,null,null,null,"I",32]
[null,null,null,null,null,null,null,null,null,null,null,null,null,null,null,null,null,null,null,null,null,null,null,null,null,null,null,null,null,null,null,null,null,null,null,null,null,null,null,null,null,null,null,null,null,null,null,null,null,null,null,null,null,"III",21]
[null,null,null,null,null,null,null,null,null,null,null,null,null,null,null,null,null,null,null,null,null,null,null,null,null,null,null,null,null,null,null,null,null,null,null,null,null,null,null,null,null,null,null,null,null,null,null,null,null,null,null,null,null,"2018-02-24",42]
[null,null,null,null,null,null,null,null,null,null,null,null,null,null,null,null,null,null,null,null,null,null,null,null,null,null,null,null,null,null,null,null,null,null,null,null,null,null,null,null,null,null,null,null,null,null,null,null,null,null,null,null,null,"I",42]
[null,null,null,null,null,null,null,null,null,null,null,null,null,null,null,null,null,null,null,null,null,null,null,null,null,null,null,null,null,null,null,null,null,null,null,null,null,null,null,null,null,null,null,null,null,null,null,null,null,null,null,null,null,"2018-02-26",35.5]
[null,null,null,null,null,null,null,null,null,null,null,null,null,null,null,null,null,null,null,null,null,null,null,null,null,null,null,null,null,null,null,null,null,null,null,null,null,null,null,null,null,null,null,null,null,null,null,null,null,null,null,null,null,"I",28]
[null,null,null,null,null,null,null,null,null,null,null,null,null,null,null,null,null,null,null,null,null,null,null,null,null,null,null,null,null,null,null,null,null,null,null,null,null,null,null,null,null,null,null,null,null,null,null,null,null,null,null,null,null,"II",59]
[null,null,null,null,null,null,null,null,null,null,null,null,null,null,null,null,null,null,null,null,null,null,null,null,null,null,null,null,null,null,null,null,null,null,null,null,null,null,null,null,null,null,null,null,null,null,null,null,null,null,null,null,null,"III",27]
[null,null,null,null,null,null,null,null,null,null,null,null,null,null,null,null,null,null,null,null,null,null,null,null,null,null,null,null,null,null,null,null,null,null,null,null,null,null,null,null,null,null,null,null,null,null,null,null,null,null,null,null,null,"2018-02-27",36]
[null,null,null,null,null,null,null,null,null,null,null,null,null,null,null,null,null,null,null,null,null,null,null,null,null,null,null,null,null,null,null,null,null,null,null,null,null,null,null,null,null,null,null,null,null,null,null,null,null,null,null,null,null,"I",27]
[null,null,null,null,null,null,null,null,null,null,null,null,null,null,null,null,null,null,null,null,null,null,null,null,null,null,null,null,null,null,null,null,null,null,null,null,null,null,null,null,null,null,null,null,null,null,null,null,null,null,null,null,null,"II",62]
[null,null,null,null,null,null,null,null,null,null,null,null,null,null,null,null,null,null,null,null,null,null,null,null,null,null,null,null,null,null,null,null,null,null,null,null,null,null,null,null,null,null,null,null,null,null,null,null,null,null,null,null,null,"III",28]
[null,null,null,null,null,null,null,null,null,null,null,null,null,null,null,null,null,null,null,null,null,null,null,null,null,null,null,null,null,null,null,null,null,null,null,null,null,null,null,null,null,null,null,null,null,null,null,null,null,null,null,null,null,"2018-02-28",40.75]
[null,null,null,null,null,null,null,null,null,null,null,null,null,null,null,null,null,null,null,null,null,null,null,null,null,null,null,null,null,null,null,null,null,null,null,null,null,null,null,null,null,null,null,null,null,null,null,null,null,null,null,null,null,"I",28]
[null,null,null,null,null,null,null,null,null,null,null,null,null,null,null,null,null,null,null,null,null,null,null,null,null,null,null,null,null,null,null,null,null,null,null,null,null,null,null,null,null,null,null,null,null,null,null,null,null,null,null,null,null,"II",80]
[null,null,null,null,null,null,null,null,null,null,null,null,null,null,null,null,null,null,null,null,null,null,null,null,null,null,null,null,null,null,null,null,null,null,null,null,null,null,null,null,null,null,null,null,null,null,null,null,null,null,null,null,null,"III",27]
[null,null,null,null,null,null,null,null,null,null,null,null,null,null,null,null,null,null,null,null,null,null,null,null,null,null,null,null,null,null,null,null,null,null,null,null,null,null,null,null,null,null,null,null,null,null,null,null,null,null,null,null,null,"2018-03-01",34.75]
[null,null,null,null,null,null,null,null,null,null,null,null,null,null,null,null,null,null,null,null,null,null,null,null,null,null,null,null,null,null,null,null,null,null,null,null,null,null,null,null,null,null,null,null,null,null,null,null,null,null,null,null,null,"I",26.5]
[null,null,null,null,null,null,null,null,null,null,null,null,null,null,null,null,null,null,null,null,null,null,null,null,null,null,null,null,null,null,null,null,null,null,null,null,null,null,null,null,null,null,null,null,null,null,null,null,null,null,null,null,null,"II",63]
[null,null,null,null,null,null,null,null,null,null,null,null,null,null,null,null,null,null,null,null,null,null,null,null,null,null,null,null,null,null,null,null,null,null,null,null,null,null,null,null,null,null,null,null,null,null,null,null,null,null,null,null,null,"III",23]
[null,null,null,null,null,null,null,null,null,null,null,null,null,null,null,null,null,null,null,null,null,null,null,null,null,null,null,null,null,null,null,null,null,null,null,null,null,null,null,null,null,null,null,null,null,null,null,null,null,null,null,null,null,"2018-03-02",57.5]
[null,null,null,null,null,null,null,null,null,null,null,null,null,null,null,null,null,null,null,null,null,null,null,null,null,null,null,null,null,null,null,null,null,null,null,null,null,null,null,null,null,null,null,null,null,null,null,null,null,null,null,null,null,"I",23]
[null,null,null,null,null,null,null,null,null,null,null,null,null,null,null,null,null,null,null,null,null,null,null,null,null,null,null,null,null,null,null,null,null,null,null,null,null,null,null,null,null,null,null,null,null,null,null,null,null,null,null,null,null,"II",92]
[null,null,null,null,null,null,null,null,null,null,null,null,null,null,null,null,null,null,null,null,null,null,null,null,null,null,null,null,null,null,null,null,null,null,null,null,null,null,null,null,null,null,null,null,null,null,null,null,null,null,null,null,null,"2018-03-03",36.5]
[null,null,null,null,null,null,null,null,null,null,null,null,null,null,null,null,null,null,null,null,null,null,null,null,null,null,null,null,null,null,null,null,null,null,null,null,null,null,null,null,null,null,null,null,null,null,null,null,null,null,null,null,null,"I",38]
[null,null,null,null,null,null,null,null,null,null,null,null,null,null,null,null,null,null,null,null,null,null,null,null,null,null,null,null,null,null,null,null,null,null,null,null,null,null,null,null,null,null,null,null,null,null,null,null,null,null,null,null,null,"II",35]
[null,null,null,null,null,null,null,null,null,null,null,null,null,null,null,null,null,null,null,null,null,null,null,null,null,null,null,null,null,null,null,null,null,null,null,null,null,null,null,null,null,null,null,null,null,null,null,null,null,null,null,null,null,"2018-03-05",21]
[null,null,null,null,null,null,null,null,null,null,null,null,null,null,null,null,null,null,null,null,null,null,null,null,null,null,null,null,null,null,null,null,null,null,null,null,null,null,null,null,null,null,null,null,null,null,null,null,null,null,null,null,null,"I",30]
[null,null,null,null,null,null,null,null,null,null,null,null,null,null,null,null,null,null,null,null,null,null,null,null,null,null,null,null,null,null,null,null,null,null,null,null,null,null,null,null,null,null,null,null,null,null,null,null,null,null,null,null,null,"III",12]
[null,null,null,null,null,null,null,null,null,null,null,null,null,null,null,null,null,null,null,null,null,null,null,null,null,null,null,null,null,null,null,null,null,null,null,null,null,null,null,null,null,null,null,null,null,null,null,null,null,null,null,null,null,"2018-03-06",53]
[null,null,null,null,null,null,null,null,null,null,null,null,null,null,null,null,null,null,null,null,null,null,null,null,null,null,null,null,null,null,null,null,null,null,null,null,null,null,null,null,null,null,null,null,null,null,null,null,null,null,null,null,null,"II",53]
[null,null,null,null,null,null,null,null,null,null,null,null,null,null,null,null,null,null,null,null,null,null,null,null,null,null,null,null,null,null,null,null,null,null,null,null,null,null,null,null,null,null,null,null,null,null,null,null,null,null,null,null,null,"2018-03-07",33.666666666666664]
[null,null,null,null,null,null,null,null,null,null,null,null,null,null,null,null,null,null,null,null,null,null,null,null,null,null,null,null,null,null,null,null,null,null,null,null,null,null,null,null,null,null,null,null,null,null,null,null,null,null,null,null,null,"I",28]
[null,null,null,null,null,null,null,null,null,null,null,null,null,null,null,null,null,null,null,null,null,null,null,null,null,null,null,null,null,null,null,null,null,null,null,null,null,null,null,null,null,null,null,null,null,null,null,null,null,null,null,null,null,"II",72]
[null,null,null,null,null,null,null,null,null,null,null,null,null,null,null,null,null,null,null,null,null,null,null,null,null,null,null,null,null,null,null,null,null,null,null,null,null,null,null,null,null,null,null,null,null,null,null,null,null,null,null,null,null,"III",1]
[null,null,null,null,null,null,null,null,null,null,null,null,null,null,null,null,null,null,null,null,null,null,null,null,null,null,null,null,null,null,null,null,null,null,null,null,null,null,null,null,null,null,null,null,null,null,null,null,null,null,null,null,null,"2018-03-08",27.666666666666668]
[null,null,null,null,null,null,null,null,null,null,null,null,null,null,null,null,null,null,null,null,null,null,null,null,null,null,null,null,null,null,null,null,null,null,null,null,null,null,null,null,null,null,null,null,null,null,null,null,null,null,null,null,null,"I",32]
[null,null,null,null,null,null,null,null,null,null,null,null,null,null,null,null,null,null,null,null,null,null,null,null,null,null,null,null,null,null,null,null,null,null,null,null,null,null,null,null,null,null,null,null,null,null,null,null,null,null,null,null,null,"II",39]
[null,null,null,null,null,null,null,null,null,null,null,null,null,null,null,null,null,null,null,null,null,null,null,null,null,null,null,null,null,null,null,null,null,null,null,null,null,null,null,null,null,null,null,null,null,null,null,null,null,null,null,null,null,"III",12]
[null,null,null,null,null,null,null,null,null,null,null,null,null,null,null,null,null,null,null,null,null,null,null,null,null,null,null,null,null,null,null,null,null,null,null,null,null,null,null,null,null,null,null,null,null,null,null,null,null,null,null,null,null,"2018-03-09",35.666666666666664]
[null,null,null,null,null,null,null,null,null,null,null,null,null,null,null,null,null,null,null,null,null,null,null,null,null,null,null,null,null,null,null,null,null,null,null,null,null,null,null,null,null,null,null,null,null,null,null,null,null,null,null,null,null,"I",31]
[null,null,null,null,null,null,null,null,null,null,null,null,null,null,null,null,null,null,null,null,null,null,null,null,null,null,null,null,null,null,null,null,null,null,null,null,null,null,null,null,null,null,null,null,null,null,null,null,null,null,null,null,null,"II",64]
[null,null,null,null,null,null,null,null,null,null,null,null,null,null,null,null,null,null,null,null,null,null,null,null,null,null,null,null,null,null,null,null,null,null,null,null,null,null,null,null,null,null,null,null,null,null,null,null,null,null,null,null,null,"III",12]
[null,null,null,null,null,null,null,null,null,null,null,null,null,null,null,null,null,null,null,null,null,null,null,null,null,null,null,null,null,null,null,null,null,null,null,null,null,null,null,null,null,null,null,null,null,null,null,null,null,null,null,null,null,"2018-03-10",32]
[null,null,null,null,null,null,null,null,null,null,null,null,null,null,null,null,null,null,null,null,null,null,null,null,null,null,null,null,null,null,null,null,null,null,null,null,null,null,null,null,null,null,null,null,null,null,null,null,null,null,null,null,null,"I",32]
[null,null,null,null,null,null,null,null,null,null,null,null,null,null,null,null,null,null,null,null,null,null,null,null,null,null,null,null,null,null,null,null,null,null,null,null,null,null,null,null,null,null,null,null,null,null,null,null,null,null,null,null,null,"2018-03-12",23.666666666666668]
[null,null,null,null,null,null,null,null,null,null,null,null,null,null,null,null,null,null,null,null,null,null,null,null,null,null,null,null,null,null,null,null,null,null,null,null,null,null,null,null,null,null,null,null,null,null,null,null,null,null,null,null,null,"I",23]
[null,null,null,null,null,null,null,null,null,null,null,null,null,null,null,null,null,null,null,null,null,null,null,null,null,null,null,null,null,null,null,null,null,null,null,null,null,null,null,null,null,null,null,null,null,null,null,null,null,null,null,null,null,"II",28]
[null,null,null,null,null,null,null,null,null,null,null,null,null,null,null,null,null,null,null,null,null,null,null,null,null,null,null,null,null,null,null,null,null,null,null,null,null,null,null,null,null,null,null,null,null,null,null,null,null,null,null,null,null,"III",20]
[null,null,null,null,null,null,null,null,null,null,null,null,null,null,null,null,null,null,null,null,null,null,null,null,null,null,null,null,null,null,null,null,null,null,null,null,null,null,null,null,null,null,null,null,null,null,null,null,null,null,null,null,null,"2018-03-13",23]
[null,null,null,null,null,null,null,null,null,null,null,null,null,null,null,null,null,null,null,null,null,null,null,null,null,null,null,null,null,null,null,null,null,null,null,null,null,null,null,null,null,null,null,null,null,null,null,null,null,null,null,null,null,"I",26]
[null,null,null,null,null,null,null,null,null,null,null,null,null,null,null,null,null,null,null,null,null,null,null,null,null,null,null,null,null,null,null,null,null,null,null,null,null,null,null,null,null,null,null,null,null,null,null,null,null,null,null,null,null,"II",24]
[null,null,null,null,null,null,null,null,null,null,null,null,null,null,null,null,null,null,null,null,null,null,null,null,null,null,null,null,null,null,null,null,null,null,null,null,null,null,null,null,null,null,null,null,null,null,null,null,null,null,null,null,null,"III",19]
[null,null,null,null,null,null,null,null,null,null,null,null,null,null,null,null,null,null,null,null,null,null,null,null,null,null,null,null,null,null,null,null,null,null,null,null,null,null,null,null,null,null,null,null,null,null,null,null,null,null,null,null,null,"2018-03-14",21]
[null,null,null,null,null,null,null,null,null,null,null,null,null,null,null,null,null,null,null,null,null,null,null,null,null,null,null,null,null,null,null,null,null,null,null,null,null,null,null,null,null,null,null,null,null,null,null,null,null,null,null,null,null,"III",21]
[null,null,null,null,null,null,null,null,null,null,null,null,null,null,null,null,null,null,null,null,null,null,null,null,null,null,null,null,null,null,null,null,null,null,null,null,null,null,null,null,null,null,null,null,null,null,null,null,null,null,null,null,null,"2018-03-15",21]
[null,null,null,null,null,null,null,null,null,null,null,null,null,null,null,null,null,null,null,null,null,null,null,null,null,null,null,null,null,null,null,null,null,null,null,null,null,null,null,null,null,null,null,null,null,null,null,null,null,null,null,null,null,"III",21]
[null,null,null,null,null,null,null,null,null,null,null,null,null,null,null,null,null,null,null,null,null,null,null,null,null,null,null,null,null,null,null,null,null,null,null,null,null,null,null,null,null,null,null,null,null,null,null,null,null,null,null,null,null,"2018-03-16",36.333333333333336]
[null,null,null,null,null,null,null,null,null,null,null,null,null,null,null,null,null,null,null,null,null,null,null,null,null,null,null,null,null,null,null,null,null,null,null,null,null,null,null,null,null,null,null,null,null,null,null,null,null,null,null,null,null,"I",23]
[null,null,null,null,null,null,null,null,null,null,null,null,null,null,null,null,null,null,null,null,null,null,null,null,null,null,null,null,null,null,null,null,null,null,null,null,null,null,null,null,null,null,null,null,null,null,null,null,null,null,null,null,null,"II",68]
[null,null,null,null,null,null,null,null,null,null,null,null,null,null,null,null,null,null,null,null,null,null,null,null,null,null,null,null,null,null,null,null,null,null,null,null,null,null,null,null,null,null,null,null,null,null,null,null,null,null,null,null,null,"III",18]
[null,null,null,null,null,null,null,null,null,null,null,null,null,null,null,null,null,null,null,null,null,null,null,null,null,null,null,null,null,null,null,null,null,null,null,null,null,null,null,null,null,null,null,null,null,null,null,null,null,null,null,null,null,"2018-03-19",25.75]
[null,null,null,null,null,null,null,null,null,null,null,null,null,null,null,null,null,null,null,null,null,null,null,null,null,null,null,null,null,null,null,null,null,null,null,null,null,null,null,null,null,null,null,null,null,null,null,null,null,null,null,null,null,"I",28]
[null,null,null,null,null,null,null,null,null,null,null,null,null,null,null,null,null,null,null,null,null,null,null,null,null,null,null,null,null,null,null,null,null,null,null,null,null,null,null,null,null,null,null,null,null,null,null,null,null,null,null,null,null,"II",25]
[null,null,null,null,null,null,null,null,null,null,null,null,null,null,null,null,null,null,null,null,null,null,null,null,null,null,null,null,null,null,null,null,null,null,null,null,null,null,null,null,null,null,null,null,null,null,null,null,null,null,null,null,null,"III",22]
[null,null,null,null,null,null,null,null,null,null,null,null,null,null,null,null,null,null,null,null,null,null,null,null,null,null,null,null,null,null,null,null,null,null,null,null,null,null,null,null,null,null,null,null,null,null,null,null,null,null,null,null,null,"2018-03-20",27]
[null,null,null,null,null,null,null,null,null,null,null,null,null,null,null,null,null,null,null,null,null,null,null,null,null,null,null,null,null,null,null,null,null,null,null,null,null,null,null,null,null,null,null,null,null,null,null,null,null,null,null,null,null,"I",26]
[null,null,null,null,null,null,null,null,null,null,null,null,null,null,null,null,null,null,null,null,null,null,null,null,null,null,null,null,null,null,null,null,null,null,null,null,null,null,null,null,null,null,null,null,null,null,null,null,null,null,null,null,null,"II",28]
[null,null,null,null,null,null,null,null,null,null,null,null,null,null,null,null,null,null,null,null,null,null,null,null,null,null,null,null,null,null,null,null,null,null,null,null,null,null,null,null,null,null,null,null,null,null,null,null,null,null,null,null,null,"III",27]
[null,null,null,null,null,null,null,null,null,null,null,null,null,null,null,null,null,null,null,null,null,null,null,null,null,null,null,null,null,null,null,null,null,null,null,null,null,null,null,null,null,null,null,null,null,null,null,null,null,null,null,null,null,"2018-03-21",31.333333333333332]
[null,null,null,null,null,null,null,null,null,null,null,null,null,null,null,null,null,null,null,null,null,null,null,null,null,null,null,null,null,null,null,null,null,null,null,null,null,null,null,null,null,null,null,null,null,null,null,null,null,null,null,null,null,"I",31]
[null,null,null,null,null,null,null,null,null,null,null,null,null,null,null,null,null,null,null,null,null,null,null,null,null,null,null,null,null,null,null,null,null,null,null,null,null,null,null,null,null,null,null,null,null,null,null,null,null,null,null,null,null,"II",37]
[null,null,null,null,null,null,null,null,null,null,null,null,null,null,null,null,null,null,null,null,null,null,null,null,null,null,null,null,null,null,null,null,null,null,null,null,null,null,null,null,null,null,null,null,null,null,null,null,null,null,null,null,null,"III",26]
[null,null,null,null,null,null,null,null,null,null,null,null,null,null,null,null,null,null,null,null,null,null,null,null,null,null,null,null,null,null,null,null,null,null,null,null,null,null,null,null,null,null,null,null,null,null,null,null,null,null,null,null,null,"2018-03-22",40.75]
[null,null,null,null,null,null,null,null,null,null,null,null,null,null,null,null,null,null,null,null,null,null,null,null,null,null,null,null,null,null,null,null,null,null,null,null,null,null,null,null,null,null,null,null,null,null,null,null,null,null,null,null,null,"I",25]
[null,null,null,null,null,null,null,null,null,null,null,null,null,null,null,null,null,null,null,null,null,null,null,null,null,null,null,null,null,null,null,null,null,null,null,null,null,null,null,null,null,null,null,null,null,null,null,null,null,null,null,null,null,"II",55.5]
[null,null,null,null,null,null,null,null,null,null,null,null,null,null,null,null,null,null,null,null,null,null,null,null,null,null,null,null,null,null,null,null,null,null,null,null,null,null,null,null,null,null,null,null,null,null,null,null,null,null,null,null,null,"III",27]
[null,null,null,null,null,null,null,null,null,null,null,null,null,null,null,null,null,null,null,null,null,null,null,null,null,null,null,null,null,null,null,null,null,null,null,null,null,null,null,null,null,null,null,null,null,null,null,null,null,null,null,null,null,"Suma końcowa",33.808383233532936]